<?xml version="1.0" encoding="UTF-8" standalone="no"?>
<svg
   xmlns:dc="http://purl.org/dc/elements/1.1/"
   xmlns:cc="http://creativecommons.org/ns#"
   xmlns:rdf="http://www.w3.org/1999/02/22-rdf-syntax-ns#"
   xmlns:svg="http://www.w3.org/2000/svg"
   xmlns="http://www.w3.org/2000/svg"
   xmlns:sodipodi="http://sodipodi.sourceforge.net/DTD/sodipodi-0.dtd"
   xmlns:inkscape="http://www.inkscape.org/namespaces/inkscape"
   height="60px"
   id="Layer_1"
   style="enable-background:new 0 0 60 60;"
   version="1.1"
   viewBox="0 0 60 60"
   width="60px"
   xml:space="preserve"
   inkscape:version="0.91 r13725"
   sodipodi:docname="linkedin-white.svg"><metadata
     id="metadata12"><rdf:RDF><cc:Work
         rdf:about=""><dc:format>image/svg+xml</dc:format><dc:type
           rdf:resource="http://purl.org/dc/dcmitype/StillImage" /></cc:Work></rdf:RDF></metadata><defs
     id="defs10" /><sodipodi:namedview
     pagecolor="#ffffff"
     bordercolor="#666666"
     borderopacity="1"
     objecttolerance="10"
     gridtolerance="10"
     guidetolerance="10"
     inkscape:pageopacity="0"
     inkscape:pageshadow="2"
     inkscape:window-width="640"
     inkscape:window-height="480"
     id="namedview8"
     showgrid="false"
     inkscape:zoom="3.9333333"
     inkscape:cx="30"
     inkscape:cy="30"
     inkscape:window-x="0"
     inkscape:window-y="0"
     inkscape:window-maximized="0"
     inkscape:current-layer="Layer_1" /><style
     type="text/css"
     id="style3"><![CDATA[
	.st0{fill:none;stroke:#231F20;stroke-width:1.5;stroke-linecap:round;stroke-linejoin:round;stroke-miterlimit:10;}
]]></style><g
     id="g5"
     style="fill:#ffffff"><path
       class="st0"
       d="M59,36.268v21.444H46.569V37.705c0-5.026-1.799-8.456-6.297-8.456   c-3.438,0-5.481,2.312-6.381,4.546c-0.328,0.799-0.412,1.912-0.412,3.032v20.884H21.046c0,0,0.166-33.885,0-37.395h12.433v5.299   c-0.024,0.041-0.057,0.083-0.081,0.122h0.081v-0.122c1.65-2.543,4.602-6.178,11.206-6.178C52.867,19.438,59,24.781,59,36.268z    M8.036,2.289C3.783,2.289,1,5.079,1,8.748c0,3.59,2.701,6.465,6.871,6.465h0.084c4.334,0,7.032-2.875,7.032-6.465   C14.906,5.079,12.29,2.289,8.036,2.289z M1.737,57.711h12.431V20.317H1.737V57.711z"
       id="LinkedIn_3_"
       style="fill:#ffffff" /></g></svg>