<?xml version="1.0" encoding="UTF-8" standalone="no"?>
<svg
   xmlns:dc="http://purl.org/dc/elements/1.1/"
   xmlns:cc="http://creativecommons.org/ns#"
   xmlns:rdf="http://www.w3.org/1999/02/22-rdf-syntax-ns#"
   xmlns:svg="http://www.w3.org/2000/svg"
   xmlns="http://www.w3.org/2000/svg"
   xmlns:sodipodi="http://sodipodi.sourceforge.net/DTD/sodipodi-0.dtd"
   xmlns:inkscape="http://www.inkscape.org/namespaces/inkscape"
   height="60px"
   id="Layer_1"
   style="enable-background:new 0 0 60 60;"
   version="1.1"
   viewBox="0 0 60 60"
   width="60px"
   xml:space="preserve"
   inkscape:version="0.91 r13725"
   sodipodi:docname="twitter-white.svg"><metadata
     id="metadata11"><rdf:RDF><cc:Work
         rdf:about=""><dc:format>image/svg+xml</dc:format><dc:type
           rdf:resource="http://purl.org/dc/dcmitype/StillImage" /></cc:Work></rdf:RDF></metadata><defs
     id="defs9" /><sodipodi:namedview
     pagecolor="#ffffff"
     bordercolor="#666666"
     borderopacity="1"
     objecttolerance="10"
     gridtolerance="10"
     guidetolerance="10"
     inkscape:pageopacity="0"
     inkscape:pageshadow="2"
     inkscape:window-width="640"
     inkscape:window-height="480"
     id="namedview7"
     showgrid="false"
     inkscape:zoom="3.9333333"
     inkscape:cx="30"
     inkscape:cy="30"
     inkscape:window-x="0"
     inkscape:window-y="0"
     inkscape:window-maximized="0"
     inkscape:current-layer="Layer_1" /><style
     type="text/css"
     id="style3"><![CDATA[
	.st0{fill:none;stroke:#231F20;stroke-width:1.5;stroke-linecap:round;stroke-linejoin:round;stroke-miterlimit:10;}
]]></style><path
     class="st0"
     d="M29.157,20.533c0,0-11.634,2.698-24.616-12.477c0,0-5.058,9.948,3.71,16.017c0,0-2.865,0.506-5.228-1.179  c0,0-1.012,8.598,9.442,11.97H6.901c0,0,1.519,6.913,11.297,8.43c0,0-4.046,5.395-17.198,5.058c0,0,7.42,5.732,18.717,5.563  c0,0,20.905,1.012,30.853-22.593c2.446-5.805,2.192-11.295,2.023-13.994L59,11.597l-6.407,1.18c0,0,4.384-3.203,4.891-6.238  l-7.082,2.866c0,0-5.311-4.805-14.332-2.866C36.069,6.539,27.809,8.225,29.157,20.533z"
     id="path5"
     style="fill:#ffffff" /></svg>