<?xml version="1.0" encoding="UTF-8" standalone="no"?>
<svg
   xmlns:dc="http://purl.org/dc/elements/1.1/"
   xmlns:cc="http://creativecommons.org/ns#"
   xmlns:rdf="http://www.w3.org/1999/02/22-rdf-syntax-ns#"
   xmlns:svg="http://www.w3.org/2000/svg"
   xmlns="http://www.w3.org/2000/svg"
   xmlns:sodipodi="http://sodipodi.sourceforge.net/DTD/sodipodi-0.dtd"
   xmlns:inkscape="http://www.inkscape.org/namespaces/inkscape"
   version="1.1"
   width="24"
   height="24"
   viewBox="0 0 24 24"
   id="svg2"
   inkscape:version="0.91 r13725"
   sodipodi:docname="linkedin-box.svg">
  <metadata
     id="metadata10">
    <rdf:RDF>
      <cc:Work
         rdf:about="">
        <dc:format>image/svg+xml</dc:format>
        <dc:type
           rdf:resource="http://purl.org/dc/dcmitype/StillImage" />
      </cc:Work>
    </rdf:RDF>
  </metadata>
  <defs
     id="defs8" />
  <sodipodi:namedview
     pagecolor="#ffffff"
     bordercolor="#666666"
     borderopacity="1"
     objecttolerance="10"
     gridtolerance="10"
     guidetolerance="10"
     inkscape:pageopacity="0"
     inkscape:pageshadow="2"
     inkscape:window-width="1366"
     inkscape:window-height="713"
     id="namedview6"
     showgrid="false"
     inkscape:zoom="9.8333333"
     inkscape:cx="-4.5894604"
     inkscape:cy="12"
     inkscape:window-x="0"
     inkscape:window-y="0"
     inkscape:window-maximized="1"
     inkscape:current-layer="svg2" />
  <path
     d="M19,19H16V13.7C16,12.87 15.33,12.2 14.5,12.2C13.67,12.2 13,12.87 13,13.7V19H10V10H13V11.2C13.5,10.36 14.59,9.8 15.5,9.8C17.43,9.8 19,11.37 19,13.3M6.5,8.31C5.5,8.31 4.69,7.5 4.69,6.5C4.69,5.5 5.5,4.69 6.5,4.69C7.5,4.69 8.31,5.5 8.31,6.5C8.31,7.5 7.5,8.31 6.5,8.31M8,19H5V10H8M20,2H4C2.89,2 2,2.89 2,4V20C2,21.1 2.9,22 4,22H20C21.1,22 22,21.1 22,20V4C22,2.89 21.1,2 20,2Z"
     id="path4"
     style="fill:#333333;fill-opacity:1" />
</svg>
