{"_id":{"$oid":"587b39d3faec628d37112b97"},"service":"ig_views,ig_usalikes,ig_likes","price":"10,20,50,100","percentage":"25,50,100,200","__v":0}
{"_id":{"$oid":"587b5218e95f1d3c38a59e70"},"service":"tw_favs,tw_retweets","price":"5,10,20,35","percentage":"10,25,50,60","__v":0}
{"_id":{"$oid":"587b53f1e95f1d3c38a59e77"},"service":"tw_usa,tw_followers,ig_hq_follows,ig_usfollows","price":"10,50","percentage":"10,15","__v":0}
{"_id":{"$oid":"587b5522e95f1d3c38a59e78"},"service":"","price":"","percentage":"","__v":0}
{"_id":{"$oid":"587b5b0fe95f1d3c38a59e83"},"service":"fb_eu,fb_latin_likes,fb_likes_canada,fb_worldwide,fb_likes_germany,fb_likes_india,fb_likes_italy,fb_likes_spain,fb_vip,fb_usa,fb_english","price":"100,500","percentage":"10,20","__v":0}
{"_id":{"$oid":"587b62cde95f1d3c38a59e8a"},"service":"yt_likes,yt_dislikes,yt_dislikes_slow,slow_yt_likes","price":"10,50,100","percentage":"25,50,99","__v":0}
{"_id":{"$oid":"587b636fe95f1d3c38a59e8b"},"service":"sc_plays","price":"10,50","percentage":"50,95","__v":0}
{"_id":{"$oid":"587b63bbe95f1d3c38a59e8c"},"service":"fb_views_auto","price":"10,50","percentage":"25,50","__v":0}
{"_id":{"$oid":"587b76fae95f1d3c38a59eb3"},"service":"fb_postlikeslite","price":"10,25,50,100","percentage":"25,35,50,65","__v":0}
{"_id":{"$oid":"58d1576e81507e7a023e6490"},"service":"yt_views_smlite_packages,yt_smlite_usa,vevo_lite,vevo_lite2,vevo_viral","price":"100,500","percentage":"15,25","__v":0}
