<?xml version="1.0" encoding="UTF-8" standalone="no"?>
<!DOCTYPE svg PUBLIC "-//W3C//DTD SVG 1.1//EN" "http://www.w3.org/Graphics/SVG/1.1/DTD/svg11.dtd" >
<svg xmlns="http://www.w3.org/2000/svg"
><metadata
></metadata
><defs
><font horiz-adv-x="1024"
><font-face font-family="icomoon" units-per-em="1024" ascent="960" descent="-64"
></font-face
><missing-glyph horiz-adv-x="1024" d=""
></missing-glyph
><glyph unicode=" " horiz-adv-x="512" d="M0 0V0V0V0Z"
></glyph
><glyph unicode="&#xe600;" horiz-adv-x="1066" d="M489 277q-5 1 -19.5 27t0.5 74v0q41 44 71.5 108.5T572 620q0 52 -16.5 92t-45 67t-65 41T369 834q-40 0 -76 -14T229.5 779t-44 -67T169 620q0 -69 28.5 -134T268 378q16 -43 -1.5 -71T243 277Q201 261 158 240T79.5 194.5T22 142.5T0 87V60Q0 22 33 -2t85.5 -38T237 -59t133 -5q67 0 132.5 5t118 19t85 38T738 60V87q0 29 -22.5 56.5t-58.5 52T577 241t-88 36v0v0ZM832 462q-4 1 -18 12.5t1 57.5v0q39 41 63 102t24 125q0 99 -53.5 150T719 960q-55 0 -99.5 -28T554 850q44 -37 72.5 -94.5T655 620q0 -83 -33 -155.5T548 343q33 -13 72 -31.5t76.5 -43t67.5 -56T809 144q51 2 97.5 9.5t82 20.5t56.5 33.5t21 49.5v26q0 27 -21 53t-54.5 49.5t-75.5 43T832 462v0v0Z"
></glyph
><glyph unicode="&#xe601;" horiz-adv-x="1123" d="M433 769q93 0 175 -35T751 638T847.5 495T883 319H786q0 71 -26.5 135.5T683 569q-50 50 -114.5 77T433 673v96v0ZM433 962q133 0 250 -50.5T887 774T1024.5 570T1075 319H979q0 56 -10.5 109.5T936 532q-20 49 -49.5 92.5T819 706q-38 37 -81.5 66.5T645 823q-50 21 -103.5 32T433 866v96v0ZM624 511q33 -33 49.5 -74.5T690 352Q642 279 634 203t-8 -76Q529 127 447 96.5T304.5 30T210 -36T176 -66l-38 37L423 256q3 0 5 -0.5t5 -0.5q26 0 45 19t19 45q0 27 -19 46t-45 19q-27 0 -46 -19T368 319q0 -2 0.5 -4.5T369 310L84 25L47 62q0 0 30 34.5T143.5 191T210 333.5T240 512q0 0 76.5 8T465 577q43 0 84.5 -16.5T624 511v0Z"
></glyph
><glyph unicode="&#xe602;" horiz-adv-x="1287" d="M336 527V488H910v39h149V488h98q48 0 84.5 31t45.5 77V832H858V936q0 10 -7 17t-18 7H456q-10 0 -17 -7t-7 -17V832H0V575Q14 537 47.5 512.5T124 488h63v39H336v0ZM481 911H809V832H481v79v0ZM1059 352V455h98q39 0 73 17.5t57 46.5V-64H0V512Q23 486 55 470.5T124 455h63V352H336V455H910V352h149v0Z"
></glyph
><glyph unicode="&#xe603;" horiz-adv-x="868" d="M801 960H68Q40 960 20 940T0 892V4Q0 -24 20 -44T68 -64H801q28 0 47.5 20T868 4V892q0 28 -19.5 48T801 960v0ZM140 809q0 12 9 20.5t21 8.5H698q13 0 21.5 -8.5T728 809V625q0 -12 -8.5 -21T698 595H170q-12 0 -21 9t-9 21V809v0ZM279 121q0 -12 -9 -20.5T249 92H142q-13 0 -21.5 8.5T112 121v78q0 12 8.5 20.5T142 228H249q12 0 21 -8.5T279 199V121v0ZM279 349q0 -13 -9 -21.5T249 319H142q-13 0 -21.5 8.5T112 349v77q0 12 8.5 20.5T142 455H249q12 0 21 -8.5T279 426V349v0ZM517 121q0 -12 -8.5 -20.5T488 92H381q-13 0 -21.5 8.5T351 121v78q0 12 8.5 20.5T381 228H488q12 0 20.5 -8.5T517 199V121v0ZM517 349q0 -13 -8.5 -21.5T488 319H381q-13 0 -21.5 8.5T351 349v77q0 12 8.5 20.5T381 455H488q12 0 20.5 -8.5T517 426V349v0ZM756 121q0 -12 -8.5 -20.5T727 92H620q-13 0 -21.5 8.5T590 121v78q0 12 8.5 20.5T620 228H727q12 0 20.5 -8.5T756 199V121v0ZM756 349q0 -13 -8.5 -21.5T727 319H620q-13 0 -21.5 8.5T590 349v77q0 12 8.5 20.5T620 455H727q12 0 20.5 -8.5T756 426V349v0Z"
></glyph
><glyph unicode="&#xe604;" horiz-adv-x="1210" d="M435 365q-5 0 -9.5 -2T417 357q-3 -3 -5 -8t-2 -10V169H69V903H571V812q8 5 17 7.5t19 2.5h37V937q0 9 -7 16t-16 7H23q-9 0 -16 -6.5T0 937V131q0 -9 6.5 -16T23 108H469q5 0 9.5 2t7.5 6l57 64V365H435v0ZM367 439L515 561q0 0 4 6t-3 14q-6 6 -30.5 25T434 646t-49 37.5T363 700q0 0 -9 6t-9 -12V630H132q0 0 -4 -1t-4 -10V522q0 -12 5 -12.5t5 -0.5H349V440q0 -15 9 -8t9 7v0v0ZM1187 788H589q-9 0 -16 -7t-7 -16V-41q0 -10 7 -16.5T589 -64h446q5 0 9.5 2t7.5 6l152 169q3 4 4.5 8t1.5 8V765q0 9 -7 16t-16 7v0v0ZM1138 192H1001q-5 0 -9.5 -1.5T983 185q-3 -3 -5 -8t-2 -10L977 -4H635V730h503V192v0ZM847 230q0 0 9 -6t9 13v63h212q0 0 4.5 1.5t4.5 9.5v97q0 12 -5 12.5t-5 0.5H861v69q0 15 -9 8.5T843 492L695 370q0 0 -4.5 -6.5T694 349q6 -5 30.5 -24.5T776 284t49 -37.5T847 230v0v0Z"
></glyph
><glyph unicode="&#xe605;" d="M439 398q0 -22 -15.5 -37T387 346q-22 0 -37.5 15T334 398q0 22 15.5 37T387 450q21 0 36.5 -15T439 398v0v0ZM651 450q-22 0 -37 -15T599 398q0 -22 15 -37t37 -15q21 0 36.5 15T703 398q0 22 -15.5 37T651 450v0v0ZM1027 427V328q0 -38 -26.5 -64T937 238H872Q847 170 806 116.5t-89.5 -91t-100 -57T519 -51q-46 0 -98 19.5t-100.5 57t-89.5 91T166 238H100q-37 0 -63.5 26T10 328v99q0 26 13 47t34 32q1 53 9 100t23 88t38 76t53 64q30 28 66 49t78.5 35.5t91 21.5T519 947q54 0 103 -7t91 -21.5T791.5 883T858 834q30 -29 52.5 -64t38 -76T972 606t8 -100q21 -11 34 -32t13 -47v0v0ZM836 398q0 17 -0.5 33.5T833 464q-30 27 -82.5 47T629 539q9 -11 16.5 -24.5T658 484q-42 33 -115 45.5T408 617q-4 4 -7 8t-6 7q0 0 0 0t0 0v0q-11 15 -15.5 22T375 651Q373 566 321 505.5T202 436q0 -9 -0.5 -18.5T201 398q0 -36 5.5 -69T222 266q38 -45 95 -62T429 184q11 16 32.5 26.5T509 221q37 0 62.5 -18.5T597 158q0 -25 -25.5 -43.5T509 96q-27 0 -49.5 11.5T428 136q-39 2 -80 10t-79 26q27 -40 59.5 -69.5T395 52.5T461 22T519 12q40 0 95 25t104 74t83.5 121T836 398v0v0ZM926 517q-2 93 -29.5 163T818 797.5T692 869T519 893q-98 0 -173 -24T219.5 797.5T141 680T112 517h35q9 63 29 113.5T227 721q48 62 121.5 94T519 847q96 0 169.5 -32T811 721q30 -39 50.5 -90T891 517h35v0Z"
></glyph
><glyph unicode="&#xe606;" horiz-adv-x="1123" d="M723 23H85V873H723V728l85 95v49q0 36 -25.5 61T721 958H87Q51 958 25.5 933T0 872V24Q0 -11 25.5 -36.5T87 -62H721q36 0 61.5 25.5T808 24V303L723 209V23v0ZM651 717q0 18 -12.5 30.5T608 760H199q-17 0 -29.5 -12.5T157 717q0 -17 12.5 -29.5T199 675H608q18 0 30.5 12.5T651 717v0v0ZM592 582H199q-17 0 -29.5 -12.5T157 539q0 -17 12.5 -29.5T199 497H516l76 85v0ZM433 406H199q-17 0 -29.5 -12.5T157 363q0 -18 12.5 -30.5T199 320H385l48 86v0ZM157 185q0 -18 12.5 -30.5T199 142H335q1 5 1.5 8t1.5 6l21 71H199q-17 0 -29.5 -12.5T157 185v0v0ZM795 713L475 357L638 210l23 26L985 596L822 743L795 713v0ZM781 564L586 347q-2 -2 -4.5 -3.5T577 342q-3 0 -5.5 1t-4.5 3l-10 8q-4 4 -4.5 9.5T556 374L751 591q2 2 4.5 3t4.5 1q3 0 5.5 -0.5T770 592l10 -9q4 -4 4.5 -9.5T781 564v0v0ZM837 667l10 -9q4 -4 4.5 -9.5T848 639l-2 -3L832 620h-1q-2 -2 -4.5 -3.5T822 615q-3 0 -5.5 1t-4.5 3l-10 9q-2 1 -3 3.5t-1 5.5q-1 3 0 5.5t3 4.5l17 19q4 4 9.5 4.5T837 667v0v0ZM850 774L838 761L1001 614l40 45L878 805L850 774v0ZM1122 770q0 10 -4 18.5T1107 803l-93 83q-7 7 -16 10t-18 2q-10 0 -18.5 -4T947 883L892 822L1056 675l54 61q7 7 10 16t2 18v0v0ZM1053 736L953 825l29 32l99 -89l-28 -32v0ZM406 116q5 -5 12 -6t13 1l188 77L456 335L399 140q-2 -7 0 -13.5T406 116v0v0ZM470 283l95 -86L492 167l-44 39l22 77v0Z"
></glyph
><glyph unicode="&#xe607;" horiz-adv-x="775" d="M153 254l26 27H371L248 501L158 483q-18 -4 -31 -16.5T109 437L2 87Q-2 73 1 58.5T13 32Q22 20 35.5 13.5T64 7h89V254v0ZM773 87L665 437q-4 18 -17.5 30.5T616 483l-90 17L404 281H610l26 -27V7h75q15 0 28.5 6.5T762 32q9 12 12 26.5T773 87v0v0ZM205 7h-7V7H584V228H205V7V7ZM101 -17H674V-64H101v47v0ZM183 656q1 -2 2 -4t2 -5q4 -10 8 -17.5T203 618q22 -71 73 -116T387 458q60 0 110.5 45T569 619q4 5 8 12t8 17q1 3 2 5t1 4q8 17 6 33t-14 25v2q0 44 -5 87.5T550 883t-58.5 56T385 960q-67 0 -106 -21T220.5 884T196 806t-5 -90q0 -1 0 -1.5t0 -0.5q-11 -9 -13.5 -25.5T183 656v0v0ZM209 694v0q2 1 4 2.5t3 3.5l31 -5q2 -1 4 0.5t3 3.5l20 45q17 -4 70.5 -14T447 720q16 0 28.5 1.5T498 726l13 -30q0 -2 2 -3t4 -1q0 0 0.5 0t0.5 0l37 10q1 -2 3 -4t4 -3h1q4 -2 5 -10t-4 -16q-1 -3 -2 -5.5T560 658q-2 -4 -4.5 -10.5T551 639q-3 -2 -4.5 -4T544 631Q527 566 483 525T387 484q-52 0 -96.5 40.5T228 630q-1 2 -2.5 4t-4.5 3q-2 3 -5 9.5T212 657q-2 3 -3 5.5t-2 4.5q-4 9 -3 17t5 10v0v0Z"
></glyph
><glyph unicode="&#xe608;" horiz-adv-x="1113" d="M730 943L290 960L261 897q-12 5 -25.5 9T208 913Q147 928 96 927.5T20 912Q12 907 7.5 901T1 887Q-1 880 0.5 872.5T7 857Q22 832 67.5 808.5T174 771q6 -2 12.5 -3.5T200 765L106 560L488 -64l625 383L730 943v0ZM179 794Q103 813 62 840.5T25 882q0 2 2 4.5t6 4.5q16 10 61 12T202 889q13 -3 25.5 -6.5T251 875L211 788q-8 1 -16 2.5T179 794v0v0ZM332 786q-1 11 1.5 21.5T342 827q4 -3 7 -6.5t5 -6.5q2 -4 3 -7t0 -5q-1 -2 -3 -4.5T349 793q-3 -2 -7.5 -3.5T332 786v0v0ZM340 761q0 1 0 1.5t0 0.5q6 2 11.5 4t10.5 5q7 5 12 11t7 13q2 7 0 15t-6 16q-3 4 -7 8.5t-9 8.5q1 1 1 1t0 1q22 13 46.5 7T444 825q14 -21 8 -45.5T424 742q-21 -14 -45.5 -8T340 761v0v0ZM513 631q-1 14 2.5 27.5T527 685q8 12 18 22t23 18q12 7 25.5 12t28.5 6q14 1 28 -2t27 -10q13 -8 24 -19t20 -27q14 -22 18.5 -43.5T739 599q-5 -21 -18 -38T687 531Q665 518 644 514t-42 1q-21 5 -38 19t-31 36q-9 15 -14 30.5T513 631v0v0ZM340 451l508 28l32 -52L371 400l-31 51v0ZM567 139q-21 5 -38 19t-31 36q-10 15 -15 30t-5 30q-1 15 2.5 28.5T492 309q7 12 17.5 22T533 348q12 8 25.5 12.5T587 367q14 1 27.5 -2T641 355q13 -8 24.5 -19T686 309q14 -22 18.5 -44T704 223q-5 -21 -18.5 -38T651 155Q630 142 609 138t-42 1v0v0ZM679 660q-3 6 -8 9.5T659 673q-10 1 -22 -3.5T609 656q-15 -9 -24.5 -18.5T572 619q-3 -6 -2.5 -12T574 595q4 -6 9 -9t11 -4q10 0 22.5 4T644 599q15 10 24.5 19T682 636q2 6 1.5 12T679 660v0v0ZM644 284q-4 6 -9 9t-11 4q-10 0 -22.5 -4T574 279q-15 -9 -24.5 -18T536 243q-2 -6 -1.5 -12T538 219q4 -6 9 -9.5T559 206q10 -1 22 3.5T608 223q16 9 25.5 18.5T647 260q2 6 1.5 12T644 284v0v0Z"
></glyph
><glyph unicode="&#xe609;" horiz-adv-x="1365" d="M1365 107q0 -23 -6 -43.5T1343 25L912 507l427 373q12 -20 19 -43t7 -48V107v0ZM683 419l593 520q-18 10 -38.5 15.5T1195 960H171q-23 0 -43.5 -5.5T89 939L683 419v0ZM848 451L711 330q-6 -5 -13.5 -7.5T682 320q-7 0 -14.5 2.5T654 330L517 451L80 -38q20 -12 43 -19t47 -7H1194q25 0 48 7t42 19L848 451v0ZM27 880Q14 860 7 837T0 789V107Q0 84 6 63.5T22 25L453 507L27 880v0Z"
></glyph
><glyph unicode="&#xe60a;" horiz-adv-x="978" d="M274 -18q1 -19 -12 -32.5T230 -64H45q-19 0 -32.5 13.5T0 -18q0 0 1 44T4 130.5t3 124T8 358Q8 397 7 459.5T4 581T1 683.5T0 727q-1 19 12.5 32.5T45 773H230q19 0 32 -13.5T274 727q0 0 -1 -43.5T270.5 581t-3 -121.5T266 358q0 -40 1.5 -103.5t3 -124T273 26t1 -44v0v0ZM622 770H484q-6 0 -10 4t-4 10q0 6 4 10.5t10 4.5H622q6 0 10.5 -4.5T637 784q0 -6 -4.5 -10T622 770v0v0ZM740 688H485q-6 0 -10 4t-4 10q0 6 4 10.5t10 4.5H740q6 0 10 -4.5T754 702q0 -6 -4 -10t-10 -4v0v0ZM941 773l-36 -1q-5 0 -7 5t-3 8q-2 10 -7.5 19.5T874 820L726 942q-9 8 -23.5 13T676 960H440q-15 0 -26 -10.5T403 923V786q0 0 -1 -6.5T393 773H363q-15 0 -26.5 -11T325 735V-27q0 -15 11 -26t27 -11H941q15 0 26 11t11 26V735q0 16 -11 27t-26 11v0v0ZM716 907q0 5 2.5 3t2.5 -2L844 804q0 0 1.5 -2.5T842 799H725q-4 0 -6.5 3t-2.5 6q0 0 0 40t0 59v0v0ZM431 923q0 4 2.5 7t6.5 3H676q7 0 10 -4t3 -7V808q0 -15 10.5 -25.5T725 772H863q6 0 6.5 -3.5T870 765V554q0 -5 -3.5 -5.5T862 548H437q-1 0 -3.5 1t-2.5 5V923v0ZM542 46q0 -10 -6.5 -16.5T519 23H438q-9 0 -16 6.5T415 46v69q0 9 7 16t16 7h81q10 0 16.5 -7T542 115V46v0ZM542 196q0 -10 -6.5 -16.5T519 173H438q-9 0 -16 6.5T415 196v69q0 9 7 16t16 7h81q10 0 16.5 -7T542 265V196v0ZM542 346q0 -10 -6.5 -16.5T519 323H438q-9 0 -16 6.5T415 346v69q0 9 7 16t16 7h81q10 0 16.5 -7T542 415V346v0ZM715 46q0 -10 -6.5 -16.5T692 23H611q-10 0 -16.5 6.5T588 46v69q0 9 7 16t16 7h81q10 0 16.5 -7T715 115V46v0ZM715 196q0 -10 -6.5 -16.5T692 173H611q-10 0 -16.5 6.5T588 196v69q0 9 7 16t16 7h81q10 0 16.5 -7T715 265V196v0ZM715 346q0 -10 -6.5 -16.5T692 323H611q-10 0 -16.5 6.5T588 346v69q0 9 7 16t16 7h81q10 0 16.5 -7T715 415V346v0ZM888 46q0 -10 -6.5 -16.5T865 23H784q-9 0 -16 6.5T761 46v69q0 9 7 16t16 7h81q10 0 16.5 -7T888 115V46v0ZM888 196q0 -10 -6.5 -16.5T865 173H784q-9 0 -16 6.5T761 196v69q0 9 7 16t16 7h81q10 0 16.5 -7T888 265V196v0ZM888 346q0 -10 -6.5 -16.5T865 323H784q-9 0 -16 6.5T761 346v69q0 9 7 16t16 7h81q10 0 16.5 -7T888 415V346v0Z"
></glyph
><glyph unicode="&#xe60b;" horiz-adv-x="521" d="M521 594H334v92q0 0 2 43.5T384 773q52 0 88 0t36 0V960H297q0 0 -27.5 -2.5T209 938.5T148.5 886T121 784q0 -28 0 -78t0 -112H0V443H120q0 -90 0 -180.5t-0.5 -163T119 -18.5T119 -64H334V443H476l45 151v0Z"
></glyph
><glyph unicode="&#xe60c;" horiz-adv-x="993" d="M252 715q0 -51 19.5 -95.5t52.5 -78t78 -53T497 469q51 0 95.5 19.5t78 53t53 78T743 715q0 50 -19.5 95t-53 78t-78 52.5T497 960q-50 0 -95 -19.5T324 888T271.5 810T252 715v0v0ZM687 757q-15 9 -15 4t0 -5l13 -12q10 -9 16 -15t2 -18q-3 -12 -10 -8.5T673 696q-12 -11 4.5 -16.5T695 659q1 -15 -11 -15T665 629q-8 -15 -5.5 -31T658 568q-4 -13 -27 -29T596 517q-11 -7 -7 8t7 28q4 14 -3.5 30.5T585 625q0 25 -9 24.5T544 649q-22 0 -33 12t-13 36q-3 24 12.5 45T536 771q10 7 23 12t27 -2q14 -8 22 -14t23 -6q16 0 19.5 4.5T663 776q9 6 -6 12t-27 5q-13 -2 -16 5t-19 13q-17 6 -24.5 -1.5T558 799q-5 -2 -18 -6t-15 6q-1 10 8 12.5t20 2.5q11 0 5.5 7T549 834q-3 7 -9.5 8.5T527 849q-5 5 4 11.5t22 3.5q12 -3 13 -9.5T581 849q14 2 7 12.5T581 884q0 12 12 14.5t22 7.5q0 0 1 0t1 0q5 -2 9.5 -5.5T635 894q6 -7 11.5 -16T657 864q2 -3 5 -2.5t6 1.5q22 -25 36 -56t18 -66q-14 -5 -18.5 2T687 757v0v0ZM497 941q7 0 13.5 -0.5T523 940q-3 -5 -5 -8.5T516 928q0 0 -5 -11T494 905q-11 -2 -23 -3T452 891q-6 -10 -8 -21.5T432 868q-10 10 -7.5 14T417 896q-10 10 -14 12t-9 2q-1 0 -2 1t-2 3q24 13 51 20t56 7v0v0ZM360 894q1 -1 3.5 -2.5T370 888q15 -6 18.5 -15T385 864q-7 1 -22.5 -3T373 850q26 -8 27 -16T389 823q-11 -4 -12 3.5T374 818q-3 -17 -6.5 -19T356 794q-8 -2 -19.5 -12.5T325 762q0 -8 -1.5 -14T332 734q10 -7 2 -16t-13 1q-5 12 -10 18.5T300 746q-6 1 -10 -7t10 -18q14 -10 17 -17.5T320 689q0 -8 8.5 -9t16.5 0q8 2 21 -13.5T385 642q5 -9 15 -17t24 -11q14 -4 18.5 -11.5T439 588q-8 -6 -11.5 -17.5T416 555q-9 -4 -12 -13t-8 -14q-3 -2 -5 -5t-4 -6q-8 5 -16 10.5T355 539q-1 12 -3.5 24.5T342 582q-8 6 -13 14.5T322 615q-3 10 0 23.5T320 662q-5 10 -7.5 8T300 682q-10 14 -12.5 18T278 716q-2 3 -3.5 8T272 735q4 48 27.5 89.5T360 894v0v0ZM239 607q0 0 -9.5 14T192 626q-25 -8 -22.5 -28.5T172 577L208 470q0 0 4.5 -17T208 431q-14 -7 -24.5 9.5T173 457L104 581l39 207q0 0 2.5 23T126 842q-15 5 -27 -2T78 807Q73 793 60 757T34 683.5T10.5 617T0 588V364L187 113l6 -177H404V246L239 607v0ZM589 246V-64H800l6 177L993 364V588q0 0 -10.5 29t-24 66.5t-26 73.5T915 807q-9 26 -21 33t-27 2q-22 -8 -19.5 -31T850 788L889 581L820 457q0 0 -10.5 -16.5T785 431q-9 5 -4.5 22t4.5 17l36 107q0 0 2.5 20T801 626q-28 9 -37.5 -5T754 607L589 246v0Z"
></glyph
><glyph unicode="&#xe60d;" horiz-adv-x="809" d="M809 -39V741q0 6 -2 10.5t-6 8.5L594 953q-4 3 -8.5 5t-9.5 2H25Q15 960 7.5 952.5T0 935V-39Q0 -49 7.5 -56.5T25 -64H784q10 0 17.5 7.5T809 -39v0v0ZM51 909H526V718q0 -11 7.5 -18T552 693H758V-13H51V909v0ZM744 743H577V899L744 743v0ZM419 303q-17 18 -48 32.5T295 359V531q26 -6 40 -23.5T351 461q0 -3 2.5 -5.5T360 453h73q3 1 6 3t3 6q0 1 -0.5 1.5T441 465q-7 63 -44 98.5T295 606v50q0 3 -2.5 5.5T286 664H246q-3 0 -5.5 -2.5T238 656V606q-34 -4 -61 -16.5T129 557Q108 536 97 507.5T86 444q0 -60 38 -99T238 289V97q-34 9 -52 33t-22 65q0 3 -2.5 5.5T155 203H83q-2 0 -3.5 -0.5T77 200q-2 -1 -2.5 -2.5T74 194Q80 119 121 76T238 22V-27q0 -4 2.5 -6.5T246 -36h40q4 0 6.5 2.5T295 -27V23q36 3 65 17t50 38q22 25 33 55t11 64q0 33 -9 59.5T419 303v0v0ZM364 193q0 -42 -17 -65.5T295 97V276q20 -6 33.5 -13T349 247q7 -9 11 -22.5T364 193v0v0ZM176 450q0 33 15 53.5T238 531V372q-13 4 -24 10t-19 13q-10 9 -14.5 22.5T176 450v0v0Z"
></glyph
><glyph unicode="&#xe60e;" horiz-adv-x="1328" d="M1311 407q19 19 17.5 44T1311 492q-7 7 -78.5 78T1078 723.5t-151 150T859 941q-28 29 -64.5 12.5T758 900V692H706q-65 0 -149 8T388.5 733T230 805T112 930q-8 14 -21.5 22T60 960Q34 960 17 941T0 900q0 -4 3 -51.5t22 -118T85.5 577T203 418q50 -50 110 -88.5T442.5 264T591 221.5T758 202V-3q0 -37 36.5 -55T859 -47l452 454v0ZM1185 448L879 139V259q0 25 -18 43t-43 18q-163 0 -278 37T347.5 451.5T225 578T156 711q64 -44 137 -71.5T439.5 597T582 576.5T706 571q54 0 85 3t33 3q22 2 38.5 19.5T879 637V755L1185 448v0Z"
></glyph
><glyph unicode="&#xe60f;" horiz-adv-x="1045" d="M763 326Q751 306 737.5 285.5T710 243Q831 225 893 193t62 -52q0 -13 -27.5 -32.5T846 71T711 39.5T523 26Q416 26 335 39.5T199.5 71t-82 37.5T90 141q0 20 62 52t184 50q-15 22 -28.5 42.5T282 326Q222 314 170.5 297T81 257T21.5 205T0 141Q0 91 45 52.5T164 -12T331.5 -51T523 -64q97 0 191 13t167.5 39T1000 52.5t45 88.5q0 35 -21.5 64T964 257t-89.5 40T763 326v0v0ZM524 960q-64 0 -119.5 -24T307 870T241 772.5T217 653q0 -45 26 -108T307 415.5T388 286T464 177q11 -14 26.5 -22T524 147q18 0 33.5 8T584 177q33 46 76 109t81 129.5T805 545t26 108q0 64 -24.5 119.5t-66 97.5T643 936T524 960v0v0ZM524 463q-75 0 -128.5 53T342 644q0 75 53.5 128.5T524 826q75 0 128 -53.5T705 644q0 -75 -53 -128T524 463v0v0ZM524 755q-46 0 -78.5 -32.5T413 644q0 -45 32.5 -77.5T524 534q46 0 78 32.5T634 644q0 46 -32 78.5T524 755v0v0Z"
></glyph
><glyph unicode="&#xe610;" horiz-adv-x="1123" d="M99 960V618H257V801H964V95H257V279H99V-64H1123V960H99ZM527 208L809 448L527 688V548H0V363H527V208Z"
></glyph
><glyph unicode="&#xe611;" horiz-adv-x="1468" d="M1468 436l-49 227l-124 27l-25 26l-37 -41l20 -223l-36 -41l-37 40l21 224l-37 41l-26 -26L1014 663L986 530L845 561l-36 36L757 540L786 228L734 170l-51 56l30 314l-53 57L624 561L483 530L454 663L331 690l-26 26L268 675L288 452L252 411l-37 40l21 224l-37 41L173 690L49 663L1 436H0L90 244H390l-8 -38h-1L508 -64H960l127 270l-9 38h299l91 192v0ZM734 606q69 0 118 49t49 118q0 69 -49 118T734 940q-69 0 -118 -49T567 773q0 -69 49 -118T734 606v0v0ZM252 722q49 0 84 35t35 84q0 49 -35 84t-84 35q-50 0 -84.5 -35T133 841q0 -49 34.5 -84T252 722v0v0ZM1335 841q0 -49 -34.5 -84T1216 722q-49 0 -84 35t-35 84q0 49 35 84t84 35q50 0 84.5 -35T1335 841v0v0Z"
></glyph
><glyph unicode="&#xe612;" d="M512 960Q406 960 312.5 920T149.5 810.5T40 647.5T0 448Q0 342 40 248.5T149.5 85.5T312.5 -24T512 -64q106 0 199.5 40.5t163 110T984 249t40 199q0 106 -40 199.5t-109.5 163T711.5 920T512 960v0v0ZM512 0Q419 0 337.5 35T195 131T99 273.5T64 448q0 93 35 174.5T195 765t142.5 96T512 896q93 0 174.5 -35T829 765T925 622.5T960 448q0 -93 -35 -174.5T829 131T686.5 35T512 0V0V0ZM704 480H544V640q0 13 -9.5 22.5T512 672q-13 0 -22.5 -9.5T480 640V480H320q-13 0 -22.5 -9.5T288 448q0 -13 9.5 -22.5T320 416H480V256q0 -13 9.5 -22.5T512 224q13 0 22.5 9.5T544 256V416H704q13 0 22.5 9.5T736 448q0 13 -9.5 22.5T704 480v0v0Z"
></glyph
><glyph unicode="&#xe613;" horiz-adv-x="1105" d="M0 128V768q0 80 56 136t136 56H485V815H622V960H913q79 0 135.5 -56T1105 768V128q0 -80 -56.5 -136T913 -64H619V50H491V-64H192Q112 -64 56 -8T0 128v0v0Z"
></glyph
><glyph unicode="&#xe614;" horiz-adv-x="1105" d="M371 467H507V176H611V467H747L559 691L371 467Z"
></glyph
><glyph unicode="&#xe615;" horiz-adv-x="974" d="M859 652q-29 27 -62.5 48T727 736q-5 -7 -10.5 -14T705 709q-8 -8 -17 -15T669 682q11 -4 21 -8t20 -8q9 -5 12.5 -15.5T720 631q-4 -9 -13.5 -11.5T688 621q-66 31 -131.5 31.5T459 648q-10 -1 -18 4t-10 15v0q-2 10 4 19.5T452 697q5 1 12.5 2t14.5 2q-2 2 -4.5 4t-4.5 4q-11 12 -20 25t-15 28q-1 2 -1.5 3.5T432 768q-10 -1 -19.5 -3T393 760q-55 33 -115.5 37.5T178 798q-17 -1 -25.5 -16.5T151 751l45 -92Q159 627 131 587.5T88 504H33Q19 504 9.5 494.5T0 471V349Q0 339 5 331.5T18 319L88 283q23 -62 67 -113T260 83V-25q0 -16 11.5 -27.5T299 -64h99q11 0 21 6.5T433 -41l25 57q16 -2 32.5 -3T523 12q27 0 52.5 2.5T625 22V-25q0 -16 11.5 -27.5T664 -64h99q10 0 19.5 5.5T797 -44q19 37 39.5 74.5t40 75t38 75.5T948 257q16 40 22 81t3 81q-6 66 -35 126.5T859 652v0v0ZM266 446q-20 0 -34.5 14.5T217 496q0 21 14.5 35.5T266 546q21 0 35.5 -14.5T316 496q0 -21 -14.5 -35.5T266 446v0v0ZM539 703q11 -5 23.5 -7T588 694q6 0 12.5 0.5T612 696q26 5 47 18.5T695 748q12 16 19 36.5t7 42.5q0 55 -39 94t-94 39q-55 0 -94 -39T455 827q0 -14 2.5 -27.5T466 773q10 -24 29 -42t44 -28v0v0Z"
></glyph
><glyph unicode="&#xe616;" horiz-adv-x="741" d="M722 705L246 951q-24 12 -58 8T120 940T57.5 903.5T15 860Q3 840 1.5 826T0 804L6 250q0 -9 9 -19.5T34 215q10 -6 78 -48.5T258.5 75T402 -15t70 -43q4 -3 9.5 -4.5T492 -64q5 0 9.5 1t8.5 3q9 4 14 12.5t5 17.5V552q0 9 -5 17t-13 13L78 823q3 7 18 21t41 27q28 15 47.5 13.5T209 881q0 0 65 -35T418 769T564.5 691T637 652q10 -5 11.5 -7.5T650 633V81q0 -21 16.5 -30T699 42q15 0 28.5 12.5T741 81V676q0 9 -5 17t-14 12v0v0Z"
></glyph
><glyph unicode="&#xe617;" d="M751 346Q700 294 683 251.5T614 209q-51 0 -102 42.5T410 346q-52 51 -94.5 102T273 550q0 52 42.5 69T410 687q25 25 6 71t-57.5 91T275 927t-70 33q-26 0 -61 -32T77 857.5T22.5 787T0 755Q0 704 24 631T86.5 481T174 331.5T273 209q50 -50 122.5 -99T545 22.5T695 -40T819 -64q0 0 32 22.5T921.5 13T992 80t32 61q0 25 -33 70t-78 83.5T822 352t-71 -6v0v0Z"
></glyph
><glyph unicode="&#xe618;" horiz-adv-x="901" d="M6 783q-15 44 6 85t64 55q43 14 84 -6.5T216 853L433 194q-15 4 -31 4.5T370 196L159 834q-6 20 -25 29.5T95 867Q74 860 64.5 841T62 802q4 -12 -1.5 -23T43 765q-12 -4 -23 1.5T6 783v0v0ZM862 267L506 149q9 -11 16.5 -23.5T535 98q0 0 0 -0.5T535 96L881 210q11 4 16.5 15t1.5 23q-3 11 -14 16.5T862 267v0v0ZM507 89Q522 43 500 0T432 -58q-45 -15 -88.5 6.5T285 16q-15 46 7 89t67 58q46 16 89 -6T507 89v0v0ZM451 71q-7 23 -28.5 34T378 108Q355 100 344 78.5T341 34Q348 11 369.5 0.5T414 -3q23 8 34 29.5T451 71v0v0ZM772 713L893 347q2 -6 -1 -11.5T883 328L503 203q-6 -2 -11.5 0.5T484 212L363 579q-2 5 1 10.5t9 7.5L753 723q6 2 11.5 -1t7.5 -9v0v0ZM722 501L592 572L530 438l41 -19l27 58L646 331l46 15L644 492l56 -31l22 40v0ZM609 719L531 953q-1 4 -4.5 6t-7.5 1L453 938v-1h-1L417 926l29 -87L406 826l-28 87L343 901h-1v0L276 879q-4 -1 -5.5 -4.5T270 867L347 633q1 -4 4.5 -5.5T359 627l243 80q4 1 6 4.5t1 7.5v0v0Z"
></glyph
><glyph unicode="&#xe619;" horiz-adv-x="1067" d="M47 270Q19 205 9.5 143.5T0 34Q0 -6 29 -35T98 -64H969q41 0 69.5 29T1067 34q0 48 -9.5 109.5T1020 270q-27 63 -64.5 127t-82 122.5T779 627T677 709H390Q338 676 288.5 627t-94 -107.5T112 397T47 270v0v0ZM602 274q-11 14 -28 20.5T540 305q-21 5 -40.5 10.5T461 332q-12 7 -21.5 16.5T424 370q-7 12 -10.5 25.5T410 425q0 27 10 49t29 39q11 9 26 16t33 10v20q0 10 7 17t17 7h13q10 0 17 -7t7 -17V539q16 -3 30.5 -9.5T624 514q12 -9 20.5 -21T658 466q4 -10 -2 -20T639 434l-13 -1q-9 -2 -16.5 2.5T600 449q-3 6 -6 11.5T587 471q-8 9 -21 14.5T538 491q-16 0 -30.5 -6T484 468q-8 -8 -11.5 -18T469 428q0 -11 3 -21t10 -17q13 -16 33 -22.5T556 357q13 -2 25 -5t23 -8q12 -5 22 -11.5T643 318q7 -7 13 -16t10 -19q4 -11 6 -22t2 -23q0 -26 -8.5 -48T641 150Q627 136 608.5 126.5T569 113V99q0 -10 -7 -17T545 75H532q-10 0 -17 7t-7 17v15q-12 2 -23 6t-21 9q-12 6 -22.5 16T422 169q-6 9 -10 19.5T405 210q-2 10 4 18.5T425 239l13 2q9 2 17 -3t10 -14q3 -11 6.5 -19.5T480 190q10 -13 26.5 -20.5T541 162q3 0 6 0t6 1q13 2 24.5 8T597 186q9 10 13 22t4 27q0 12 -3 22t-9 17v0v0ZM539 960h-1H351q-26 -1 -38 -23.5T315 893L399 766H678l84 127q14 21 2 43.5T727 960H539v0Z"
></glyph
><glyph unicode="&#xe61a;" horiz-adv-x="1031" d="M923 804q-32 37 -71 66t-82.5 49T679 949.5T583 960q-49 0 -96.5 -10.5T395.5 919t-82 -49T243 804Q216 773 196 739T162 667.5T141 591t-7 -80q0 -14 1 -28.5T138 454h59q-1 8 -2 17.5T193 490H331q1 -10 1.5 -19T333 454h44q0 8 -1 17t-1 19H561V387q7 -4 14 -8.5T588 368l17 -16V490H790q-1 -46 -8 -89.5T763 318q-34 9 -71 14.5T617 339l49 -48q21 -3 42 -6.5T749 276q-5 -12 -10.5 -24T727 230q10 -12 15 -25.5T747 176q13 19 24.5 41.5T792 264q18 -5 35 -12t32 -15Q835 212 806.5 192.5T748 158V94q50 20 94.5 51.5T923 219q26 31 46 65t34 71.5t21 76.5t7 79q0 41 -7 80t-21 76.5T969 739t-46 65v0v0ZM331 533H193q4 60 25 116t59 104q18 -11 39 -19.5T359 717Q347 676 340 629.5T331 533v0v0ZM373 759q-18 6 -35 12.5T306 786q28 29 61 51t70 36Q418 850 402 821T373 759v0v0ZM561 533H375q1 47 8 90t19 82q37 -10 77 -15.5T561 683V533v0ZM561 728q-38 1 -74.5 5.5T416 747q22 56 53.5 96T538 899q5 1 11 1.5t12 0.5V728v0ZM972 533H834q-1 50 -8.5 96.5T806 717q23 8 43.5 16.5T889 753q37 -47 58 -103.5T972 533v0v0ZM604 901q6 0 12 -0.5T628 899q36 -16 67.5 -56T749 746q-34 -8 -70.5 -12.5T604 728V901v0ZM604 533V683q42 1 82 6.5T763 705q12 -39 19 -82t8 -90H604v0ZM728 873q37 -14 70 -36t61 -51q-15 -8 -32 -14.5T792 759q-13 33 -29 62t-35 52v0v0ZM889 270q-19 11 -39.5 19.5T806 306q12 41 19.5 87.5T834 490H972Q968 430 947 373.5T889 270v0v0ZM704 148v25q0 9 -3.5 17.5T690 205L557 337q-7 7 -15 10t-17 3H457v26q0 14 -10 24t-24 10H34Q20 410 10 400T0 376V148H704v0ZM497 306q0 2 2 3.5t4 1.5h24q1 0 2 -0.5t2 -0.5L636 210q2 -3 1 -6t-5 -3H503q-3 0 -4.5 1.5T497 206V306v0ZM704 129V54Q704 40 694 30T670 20H633q-5 34 -31 57t-61 23q-35 0 -61 -23T449 20H264q-5 34 -31 57t-61 23q-35 0 -61 -23T80 20H34Q20 20 10 30T0 54v75H704v0ZM541 77Q512 77 491 56.5T470 7q0 -30 21 -50.5T541 -64q29 0 50 20.5T612 7q0 29 -21 49.5T541 77v0v0ZM541 -29q-15 0 -25 10.5T506 7q0 14 10 24.5T541 42q15 0 25 -10.5T576 7q0 -15 -10 -25.5T541 -29v0v0ZM172 77Q143 77 122 56.5T101 7q0 -30 21 -50.5T172 -64q29 0 49.5 20.5T242 7q0 29 -20.5 49.5T172 77v0v0ZM172 -29q-15 0 -25 10.5T137 7q0 14 10 24.5T172 42q14 0 24.5 -10.5T207 7q0 -15 -10.5 -25.5T172 -29v0v0Z"
></glyph
><glyph unicode="&#xe61b;" horiz-adv-x="1229" d="M1229 482L751 960V687Q572 661 441.5 588.5T221.5 414T79 188T0 -64Q64 26 141.5 91.5T311.5 200t202 63.5T751 284V4l478 478v0Z"
></glyph
><glyph unicode="&#xe61c;" horiz-adv-x="1350" d="M1332 152h-42V388q0 21 -6 40.5T1267 465L1161 622q-20 29 -50.5 45T1046 683H882q-14 0 -24.5 -10T847 648V152H579q19 -16 31.5 -38.5T627 65H910q7 51 47 86.5t94 35.5q54 0 93.5 -35.5T1192 65h141q7 0 12 5t5 12v53q0 7 -5 12t-13 5v0v0ZM1160 434H943q-7 0 -12 5t-5 13V572q0 7 5 12t12 5h132q4 0 8 -2t6 -5l85 -120q6 -9 1 -18.5T1160 434v0v0ZM1051 152q-45 0 -76.5 -31.5T943 44q0 -45 31.5 -76.5T1051 -64q45 0 76.5 31.5T1159 44q0 45 -31.5 76.5T1051 152v0v0ZM1051 -10q-22 0 -38 16T997 44q0 22 16 38t38 16q22 0 38 -16t16 -38q0 -22 -16 -38t-38 -16v0v0ZM151 152q-7 0 -12 -5t-5 -12V82q0 -7 5 -12t12 -5H345q4 26 16.5 48T393 152H151v0ZM486 152q-45 0 -76.5 -31.5T378 44q0 -45 31.5 -76.5T486 -64q45 0 76.5 31.5T594 44q0 45 -31.5 76.5T486 152v0v0ZM486 -10q-22 0 -38 16T432 44q0 22 16 38t38 16q22 0 38 -16T540 44Q540 22 524 6T486 -10v0v0ZM746 791H544q8 -22 11.5 -45.5T559 698q0 -62 -23 -116T472.5 487.5T378 423.5T262 400q-22 0 -43.5 3.5T176 413V221q0 -7 5 -12t13 -5H780q7 0 12.5 5t5.5 12V739q0 21 -15.5 36.5T746 791v0v0ZM262 960q-54 0 -102 -20.5t-83.5 -56T20.5 800T0 698Q0 643 20.5 595.5T76.5 512T160 455.5T262 435q55 0 102.5 20.5T448 512t56.5 83.5T525 698q0 54 -20.5 102T448 883.5t-83.5 56T262 960v0v0ZM262 495q-42 0 -78.5 16t-64 43.5T76 619T60 698q0 42 16 78.5t43.5 64t64 43.5T262 900q42 0 79 -16t64.5 -43.5t43.5 -64T465 698q0 -42 -16 -79T405.5 554.5T341 511T262 495v0v0ZM340 655q-2 0 -3.5 0t-3.5 1l-85 23q-8 2 -13.5 9T229 704V834q0 11 8 18.5t18 7.5q11 0 18.5 -7.5T281 834V724l66 -18q10 -3 15.5 -12T365 674q-2 -9 -9.5 -14T340 655v0v0Z"
></glyph
><glyph unicode="&#xe61d;" d="M1024 634V913q0 20 -13.5 33.5T977 960H698q-19 0 -32.5 -13.5T652 913V797q-86 0 -162.5 -27.5T350.5 693T243.5 576.5T179 430l-48 9q-7 1 -13 -1.5T108 430q-4 -6 -4.5 -12.5T106 405l50 -99Q90 295 45 243T0 122Q0 45 54.5 -9.5T186 -64q71 0 123.5 47T371 99H535V52q0 -6 3.5 -11.5T548 31q6 -2 12.5 -1.5T572 34l82 61Q664 28 716 -18T838 -64q77 0 131.5 54.5T1024 122q0 71 -47 123.5T861 307V471h47q6 0 11.5 3.5T928 484q3 6 2.5 12.5T926 508l-59 80H977q20 0 33.5 13.5T1024 634v0v0ZM186 29q-38 0 -65.5 27.5T93 122q0 39 27.5 66T186 215q39 0 66 -27t27 -66Q279 84 252 56.5T186 29v0v0ZM931 122Q931 84 903.5 56.5T838 29q-39 0 -66 27.5T745 122q0 39 27 66t66 27q38 0 65.5 -27T931 122v0v0ZM747 484q3 -6 8.5 -9.5T768 471h47V307Q753 299 708 255T654 150l-81 61q-6 4 -12.5 4.5T548 213q-6 -3 -9.5 -8.5T535 192V146H371q-8 63 -53.5 108T209 307q0 0 0 0.5t0 1.5v0l71 66q5 4 6.5 10.5T286 398q-2 7 -6.5 11T268 415l-43 7q19 71 59 131t96.5 104T506 726t146 25V634q0 -19 13.5 -32.5T698 588H809L749 509q-4 -6 -4.5 -12.5T747 484v0v0ZM931 681H745V867H931V681v0Z"
></glyph
><glyph unicode="&#xe61e;" d="M1024 410v76H890q-6 57 -28 108.5T806 688l95 95l-54 54L752 742q-42 34 -93.5 56T550 826V960H474V826Q417 820 365.5 798T272 742l-95 95L123 783l95 -95Q184 646 162 594.5T134 486H0V410H134q6 -57 28 -108.5T218 208L123 113L177 59l95 95q42 -34 93.5 -56T474 70V-64h76V70q57 6 108.5 28T752 154L847 59l54 54l-95 95q34 42 56 93.5T890 410h134v0ZM796 486H603L740 622q22 -29 36.5 -63.5T796 486v0v0ZM686 676L550 539V732q38 -5 72.5 -19.5T686 676v0v0ZM474 732V539L338 676q29 22 63.5 36.5T474 732v0v0ZM284 622L421 486H228q5 38 19.5 72.5T284 622v0v0ZM228 410H421L284 274q-22 29 -36.5 63.5T228 410v0v0ZM338 220L474 357V164q-38 5 -72.5 19.5T338 220v0v0ZM550 164V357L686 220Q657 198 622.5 183.5T550 164v0v0ZM740 274L603 410H796q-5 -38 -19.5 -72.5T740 274v0v0Z"
></glyph
><glyph unicode="&#xe61f;" horiz-adv-x="978" d="M927 386q2 14 3 29t1 31q0 91 -35 171.5T801 758T660 853T487 888q-19 0 -36.5 -1.5T415 882q-31 20 -68 31.5T270 925q-55 0 -103 -21T83 847T26 763T5 660Q5 620 16.5 583.5T48 515Q45 498 43.5 480.5T42 446Q42 354 77 273.5T172.5 133T314 38.5T487 4q20 0 40.5 2T568 11q30 -19 65.5 -29.5T708 -29q55 0 103 21t84 57t57 84.5T973 236q0 42 -12 80t-34 70v0v0ZM528 120Q422 114 364 136T260 201q-50 47 -38 91.5T275 340q41 3 68.5 -32T393 259q22 -13 88.5 -28T593 267q48 55 -7.5 84.5T471 390q-42 6 -86.5 20.5T304 449t-57.5 58T229 586q8 89 66.5 135.5T426 775q90 8 152.5 -12T688 703q54 -46 37.5 -88.5T675 568q-34 -5 -78 48T477 670q-78 2 -110 -57t64 -82q48 -12 96.5 -22t91 -26.5t76 -43T747 369q18 -44 6 -87.5T709 203T629 145.5T528 120v0v0Z"
></glyph
><glyph unicode="&#xe620;" horiz-adv-x="1261" d="M1261 839q-35 -16 -72.5 -26T1112 798q40 24 69.5 61t44.5 82q-38 -22 -79 -38t-86 -25q-35 38 -83.5 60T873 960q-54 0 -101 -20.5T690 884T634.5 802T614 701q0 -15 2 -29.5T621 643q-81 4 -156.5 24.5T321.5 723T195 806T88 913Q71 884 62 851T53 783Q53 715 84.5 658.5T168 568q-32 1 -61.5 9T51 600v-3q0 -47 15.5 -89T110 432t66 -57t82 -32q-16 -4 -33 -6.5T190 334q-12 0 -24.5 1.5T141 339q13 -39 36 -71.5t55 -56T302 174t81 -15Q350 133 312.5 112.5T234.5 78t-84 -21.5T62 49Q46 49 30.5 50T0 52Q43 25 89.5 3.5T186 -33T289 -56t107 -8q179 0 316 67T942.5 176T1084 413t48 259l-1 33q38 27 71 61t59 73v0Z"
></glyph
><glyph unicode="&#xe621;" horiz-adv-x="978" d="M4 -41q0 1 0 2t1 2Q25 25 46 86.5T88 210q1 2 0.5 4T87 218Q65 255 50 295T28 377q-5 27 -6.5 54.5T21 486q5 83 35 156t85 135q52 58 115.5 95T395 926q30 7 60.5 9.5T516 937q43 -2 84 -10.5t78.5 -24t72.5 -38T818 813q56 -50 92.5 -113T963 563q7 -30 9.5 -60.5T974 441q-2 -43 -10.5 -82.5T940 282T903.5 210.5T854 144Q802 86 738 48.5T598 -6q-30 -6 -60 -8.5T478 -16Q423 -14 371 0.5T270 41q-2 1 -3.5 1T263 42Q199 21 135 0.5T7 -40Q6 -41 5.5 -41T4 -41v0ZM127 81q2 0 3 0.5t2 0.5q36 11 72 22.5T276 128q2 1 3.5 0.5T282 127Q328 98 377.5 82T481 64q28 -1 56 1.5T593 75q63 16 117 50.5t94 83T867.5 316T894 441q1 25 -0.5 49.5T887 539q-14 64 -45 118.5T762 756q-52 47 -113.5 72T517 857q-29 2 -57.5 -1T403 846Q345 832 295.5 802.5T206 729Q158 678 132 616.5T101 485q-1 -25 0.5 -49.5T107 387q8 -43 25 -81.5T174 231q1 -1 1.5 -3T175 224Q163 189 151.5 154.5T128 85q0 -1 -0.5 -2T127 81v0ZM625 221q-9 1 -17 2.5T592 227q-19 6 -36.5 13T520 254q-13 6 -26 12t-25 13q-23 14 -43.5 31T387 346q-22 22 -41.5 46.5T309 444q-4 8 -9.5 15.5T290 475q-9 16 -16 33t-11 35q-5 25 -2.5 49.5T275 640q4 9 10 17t13 15q1 2 3 3.5t4 3.5q8 9 19 12.5t23 1.5q5 0 10 -0.5t9 -0.5q5 0 8.5 -1.5T381 685q3 -3 4.5 -7t3.5 -7q5 -16 11 -31.5T412 609q3 -8 5.5 -16T424 577q2 -5 1.5 -10T422 556q-4 -8 -9.5 -15T400 527q-2 -3 -5 -6t-6 -6q0 0 -1 -1t-2 -2q-3 -4 -3.5 -8t1.5 -9q0 -1 0.5 -1.5T385 492q12 -22 26.5 -42.5T444 411q19 -20 40.5 -35.5T530 349q5 -2 9 -4.5t8 -4.5q1 0 2.5 -0.5T552 338q5 -2 10 -1t8 5q4 4 7.5 8t6.5 7q8 9 15 17t14 17q4 6 8.5 7T633 397q4 -1 7.5 -2.5T648 391q18 -9 36 -18.5T720 353q3 -2 6 -3.5t6 -3.5q1 0 2.5 -1t2.5 -2q5 -2 6.5 -5.5T745 329q0 -11 -2 -21t-5 -20q-3 -9 -8.5 -17T717 256Q704 246 689.5 238T659 226q-2 -1 -4.5 -1t-4.5 0q-4 0 -7.5 -1T636 222q-3 0 -6 -0.5T625 221v0Z"
></glyph
><glyph unicode="&#xe622;" horiz-adv-x="1145" d="M1145 373V-13q0 -12 -8.5 -20T1117 -41H996q-12 0 -20 8t-8 20V36q-2 -4 -4.5 -7T957 25Q911 18 864.5 3t-94 -30T675 -53T579 -64q-45 0 -95 5t-98.5 18T293 -6T216 49q-36 37 -69 72T87 185T41 235.5T14 269q-32 47 1 75t68 -9q15 -15 37.5 -38.5t49 -49t54 -50T275 157q8 -32 44 -57T398 75H721q0 0 -13.5 14T675 105H400q-27 0 -61.5 22.5T304 198q0 58 36.5 76T400 292H638q0 0 56.5 32T816 356q50 0 88.5 -13T959 321q3 -1 5.5 -4t3.5 -6v62q0 12 8 20t20 8h121q11 0 19.5 -8t8.5 -20v0v0ZM288 254q-6 9 -27 29.5t-47 42t-51.5 40T122 390q-23 9 -30.5 -3T84 375q0 0 26 -22.5t58.5 -51t61 -53T263 219q12 3 21 14.5t4 20.5v0v0ZM269 508V856q0 43 30.5 73.5T373 960H533V881h74v79H765q43 0 73.5 -30.5T869 856V508q0 -44 -30.5 -74.5T765 403H605v62H536V403H373q-43 0 -73.5 30.5T269 508v0v0ZM470 692h74V534h57V692h74L573 814L470 692v0ZM320 321q-12 19 -57 54t-74 47q-23 9 -30.5 -3T151 407q0 0 20.5 -17.5t46.5 -39t49 -41T295 286q12 3 21 14.5t4 20.5v0v0Z"
></glyph
><glyph unicode="&#xe623;" horiz-adv-x="1028" d="M560 173l-38 22q2 11 3 21.5t1 21.5q0 11 -1 21.5T522 281l37 22q7 3 11 8.5t6 12.5q2 7 1 14t-5 13l-44 77q-7 12 -21 16t-27 -4L442 419q-16 13 -34.5 24T368 461v44q0 15 -10.5 25T333 540H244q-14 0 -24.5 -10T209 505V461q-21 -7 -39.5 -18T135 419L97 440q-13 8 -27 4T49 428L5 351Q-3 338 1 324T18 303L55 281Q54 270 52.5 259.5T51 238q0 -11 1.5 -21.5T55 195L18 173Q5 166 1 152T5 126L49 49q4 -6 9.5 -10.5T70 32q7 -2 14 -1t13 5l38 22Q151 44 170 33T209 15V-29q0 -14 10.5 -24.5T244 -64h89q15 0 25 10.5T368 -29V15q21 7 39.5 18T442 58L480 36q13 -7 27 -3.5T528 49l44 77q8 12 4 26t-16 21v0v0ZM289 89q-62 0 -106 43.5T139 238q0 62 44 105.5T289 387q61 0 105 -43.5T438 238q0 -62 -44 -105.5T289 89v0v0ZM289 353q-48 0 -81.5 -33.5T174 238q0 -47 33.5 -81T289 123q47 0 80.5 34T403 238q0 48 -33.5 81.5T289 353v0v0ZM989 325q-26 28 -61 39t-70 6L477 780q8 35 -0.5 70.5T442 914q-23 24 -53 35.5T328 960q-4 0 -7.5 -2.5T315 951q-1 -4 -0.5 -8t3.5 -7l40 -43q3 -3 4.5 -7t1.5 -8q-1 -4 -2.5 -7.5T357 865L283 795q-6 -5 -14.5 -5T254 796l-40 44q-2 3 -6 4t-8 -1q-4 -1 -7 -4t-3 -7q-4 -31 5 -62t32 -56q26 -27 61 -38.5T358 670L740 259q-9 -35 0 -70.5T775 125q23 -24 53 -35.5T889 79q4 0 7.5 2.5T901 88q2 4 1 8t-4 7l-40 43q-5 6 -5 14.5t6 14.5l75 69q6 5 14 5t14 -6l40 -44q3 -3 7 -4t8 1q4 1 6.5 4t3.5 7q4 31 -5.5 62T989 325v0v0Z"
></glyph
></font
></defs
><g style="font-family: &quot;icomoon&quot;; font-size:50;fill:black"
><text x="20" y="50"
>!&quot;#$%&amp;&#39;()*+,-./0123456789:;&#229;&lt;&gt;?</text
><text x="20" y="100"
>@ABCDEFGHIJKLMNOPQRSTUVWXYZ[\]^_</text
><text x="20" y="150"
>` abcdefghijklmnopqrstuvwxyz|{}~</text
></g
></svg
>