<?xml version="1.0" encoding="utf-8"?>
<!-- Generator: Adobe Illustrator 19.0.1, SVG Export Plug-In . SVG Version: 6.00 Build 0)  -->
<svg version="1.1" id="Layer_1" xmlns="http://www.w3.org/2000/svg" xmlns:xlink="http://www.w3.org/1999/xlink" x="0px" y="0px"
	 viewBox="0 0 23 15" style="enable-background:new 0 0 23 15;" xml:space="preserve">
<style type="text/css">
	.st0{fill:#E86136;}
</style>
<g>
	<rect class="st0" width="23" height="3"/>
	<rect y="6" class="st0" width="23" height="3"/>
	<rect y="12" class="st0" width="23" height="3"/>
</g>
</svg>
