{
    "name": [".prettierrc"],
    "command": ["yarn add -D prettier"],
    "url": ["https://gitlab.com/api/v4/projects/15307846/repository/files/.prettierrc/raw?ref=master"],
    "fileToEdit" : ["package.json"],
    "editAction" : [[{"type": "add", "content" : "{ 'husky': { 'hooks': { 'pre-commit': 'pretty-quick --staged' } } }"}]]
}