<?xml version="1.0" encoding="UTF-8"?>
<!--Created using Glyph Designer - http://www.71squared.com/glyphdesigner-->
<font>
    <info face="Avenir" size="32" bold="1" italic="0" chasrset="" unicode="0" stretchH="100" smooth="1" aa="1" padding="0,0,0,0" spacing="2,2"/>
    <common lineHeight="44" base="32" scaleW="190" scaleH="299" pages="1" packed="0"/>
    <pages>
        <page id="0" file="AvenirYellowBold@2.png"/>
    </pages>
    <chars count="95">
        <char id="32" x="75" y="273" width="0" height="0" xoffset="0" yoffset="32" xadvance="9" page="0" chnl="0" letter="space"/>
        <char id="33" x="35" y="205" width="8" height="25" xoffset="2" yoffset="7" xadvance="9" page="0" chnl="0" letter="!"/>
        <char id="34" x="143" y="253" width="11" height="11" xoffset="4" yoffset="7" xadvance="17" page="0" chnl="0" letter="&quot;"/>
        <char id="35" x="88" y="178" width="18" height="25" xoffset="2" yoffset="7" xadvance="19" page="0" chnl="0" letter="#"/>
        <char id="36" x="98" y="2" width="19" height="30" xoffset="1" yoffset="5" xadvance="19" page="0" chnl="0" letter="$"/>
        <char id="37" x="153" y="2" width="30" height="27" xoffset="1" yoffset="6" xadvance="29" page="0" chnl="0" letter="%"/>
        <char id="38" x="30" y="67" width="24" height="26" xoffset="2" yoffset="7" xadvance="24" page="0" chnl="0" letter="&amp;"/>
        <char id="39" x="167" y="253" width="6" height="11" xoffset="3" yoffset="7" xadvance="9" page="0" chnl="0" letter="'"/>
        <char id="40" x="52" y="2" width="10" height="31" xoffset="2" yoffset="6" xadvance="9" page="0" chnl="0" letter="("/>
        <char id="41" x="64" y="2" width="10" height="31" xoffset="1" yoffset="6" xadvance="9" page="0" chnl="0" letter=")"/>
        <char id="42" x="82" y="253" width="16" height="15" xoffset="1" yoffset="7" xadvance="15" page="0" chnl="0" letter="*"/>
        <char id="43" x="90" y="205" width="20" height="20" xoffset="2" yoffset="11" xadvance="21" page="0" chnl="0" letter="+"/>
        <char id="44" x="156" y="253" width="9" height="11" xoffset="1" yoffset="25" xadvance="9" page="0" chnl="0" letter=","/>
        <char id="45" x="43" y="273" width="10" height="6" xoffset="1" yoffset="20" xadvance="10" page="0" chnl="0" letter="-"/>
        <char id="46" x="33" y="273" width="8" height="7" xoffset="2" yoffset="25" xadvance="9" page="0" chnl="0" letter="."/>
        <char id="47" x="119" y="2" width="15" height="28" xoffset="-0" yoffset="6" xadvance="12" page="0" chnl="0" letter="/"/>
        <char id="48" x="130" y="67" width="19" height="26" xoffset="1" yoffset="6" xadvance="19" page="0" chnl="0" letter="0"/>
        <char id="49" x="20" y="205" width="13" height="25" xoffset="2" yoffset="7" xadvance="19" page="0" chnl="0" letter="1"/>
        <char id="50" x="107" y="95" width="18" height="26" xoffset="2" yoffset="6" xadvance="19" page="0" chnl="0" letter="2"/>
        <char id="51" x="127" y="95" width="18" height="26" xoffset="1" yoffset="6" xadvance="19" page="0" chnl="0" letter="3"/>
        <char id="52" x="46" y="178" width="19" height="25" xoffset="1" yoffset="7" xadvance="19" page="0" chnl="0" letter="4"/>
        <char id="53" x="147" y="95" width="18" height="26" xoffset="1" yoffset="6" xadvance="19" page="0" chnl="0" letter="5"/>
        <char id="54" x="151" y="67" width="19" height="26" xoffset="1" yoffset="6" xadvance="19" page="0" chnl="0" letter="6"/>
        <char id="55" x="108" y="178" width="18" height="25" xoffset="1" yoffset="7" xadvance="19" page="0" chnl="0" letter="7"/>
        <char id="56" x="167" y="95" width="18" height="26" xoffset="2" yoffset="6" xadvance="19" page="0" chnl="0" letter="8"/>
        <char id="57" x="2" y="95" width="19" height="26" xoffset="1" yoffset="6" xadvance="19" page="0" chnl="0" letter="9"/>
        <char id="58" x="72" y="253" width="8" height="18" xoffset="2" yoffset="14" xadvance="9" page="0" chnl="0" letter=":"/>
        <char id="59" x="79" y="205" width="9" height="22" xoffset="1" yoffset="14" xadvance="9" page="0" chnl="0" letter=";"/>
        <char id="60" x="112" y="205" width="19" height="19" xoffset="3" yoffset="12" xadvance="21" page="0" chnl="0" letter="&lt;"/>
        <char id="61" x="121" y="253" width="20" height="12" xoffset="2" yoffset="15" xadvance="21" page="0" chnl="0" letter="="/>
        <char id="62" x="133" y="205" width="19" height="19" xoffset="3" yoffset="12" xadvance="21" page="0" chnl="0" letter="&gt;"/>
        <char id="63" x="22" y="123" width="17" height="26" xoffset="2" yoffset="6" xadvance="17" page="0" chnl="0" letter="?"/>
        <char id="64" x="2" y="67" width="26" height="26" xoffset="1" yoffset="7" xadvance="26" page="0" chnl="0" letter="@"/>
        <char id="65" x="124" y="123" width="26" height="25" xoffset="0" yoffset="7" xadvance="23" page="0" chnl="0" letter="A"/>
        <char id="66" x="67" y="178" width="19" height="25" xoffset="3" yoffset="7" xadvance="21" page="0" chnl="0" letter="B"/>
        <char id="67" x="82" y="67" width="23" height="26" xoffset="1" yoffset="7" xadvance="22" page="0" chnl="0" letter="C"/>
        <char id="68" x="54" y="151" width="23" height="25" xoffset="3" yoffset="7" xadvance="24" page="0" chnl="0" letter="D"/>
        <char id="69" x="128" y="178" width="18" height="25" xoffset="3" yoffset="7" xadvance="20" page="0" chnl="0" letter="E"/>
        <char id="70" x="168" y="178" width="17" height="25" xoffset="3" yoffset="7" xadvance="18" page="0" chnl="0" letter="F"/>
        <char id="71" x="56" y="67" width="24" height="26" xoffset="1" yoffset="7" xadvance="25" page="0" chnl="0" letter="G"/>
        <char id="72" x="128" y="151" width="21" height="25" xoffset="3" yoffset="7" xadvance="24" page="0" chnl="0" letter="H"/>
        <char id="73" x="45" y="205" width="7" height="25" xoffset="2" yoffset="7" xadvance="9" page="0" chnl="0" letter="I"/>
        <char id="74" x="41" y="123" width="16" height="26" xoffset="0" yoffset="7" xadvance="16" page="0" chnl="0" letter="J"/>
        <char id="75" x="104" y="151" width="22" height="25" xoffset="3" yoffset="7" xadvance="22" page="0" chnl="0" letter="K"/>
        <char id="76" x="2" y="205" width="16" height="25" xoffset="3" yoffset="7" xadvance="17" page="0" chnl="0" letter="L"/>
        <char id="77" x="95" y="123" width="27" height="25" xoffset="3" yoffset="7" xadvance="30" page="0" chnl="0" letter="M"/>
        <char id="78" x="79" y="151" width="23" height="25" xoffset="3" yoffset="7" xadvance="25" page="0" chnl="0" letter="N"/>
        <char id="79" x="137" y="38" width="27" height="26" xoffset="1" yoffset="7" xadvance="27" page="0" chnl="0" letter="O"/>
        <char id="80" x="148" y="178" width="18" height="25" xoffset="3" yoffset="7" xadvance="20" page="0" chnl="0" letter="P"/>
        <char id="81" x="107" y="38" width="28" height="26" xoffset="1" yoffset="6" xadvance="27" page="0" chnl="0" letter="Q"/>
        <char id="82" x="151" y="151" width="20" height="25" xoffset="3" yoffset="7" xadvance="20" page="0" chnl="0" letter="R"/>
        <char id="83" x="2" y="123" width="18" height="26" xoffset="1" yoffset="7" xadvance="18" page="0" chnl="0" letter="S"/>
        <char id="84" x="2" y="178" width="20" height="25" xoffset="0" yoffset="7" xadvance="18" page="0" chnl="0" letter="T"/>
        <char id="85" x="107" y="67" width="21" height="26" xoffset="2" yoffset="7" xadvance="23" page="0" chnl="0" letter="U"/>
        <char id="86" x="152" y="123" width="24" height="25" xoffset="-0" yoffset="7" xadvance="21" page="0" chnl="0" letter="V"/>
        <char id="87" x="59" y="123" width="34" height="25" xoffset="0" yoffset="7" xadvance="31" page="0" chnl="0" letter="W"/>
        <char id="88" x="2" y="151" width="24" height="25" xoffset="0" yoffset="7" xadvance="22" page="0" chnl="0" letter="X"/>
        <char id="89" x="28" y="151" width="24" height="25" xoffset="-0" yoffset="7" xadvance="20" page="0" chnl="0" letter="Y"/>
        <char id="90" x="24" y="178" width="20" height="25" xoffset="1" yoffset="7" xadvance="20" page="0" chnl="0" letter="Z"/>
        <char id="91" x="76" y="2" width="9" height="31" xoffset="2" yoffset="6" xadvance="9" page="0" chnl="0" letter="["/>
        <char id="92" x="136" y="2" width="15" height="28" xoffset="0" yoffset="6" xadvance="12" page="0" chnl="0" letter="\"/>
        <char id="93" x="87" y="2" width="9" height="31" xoffset="1" yoffset="6" xadvance="9" page="0" chnl="0" letter="]"/>
        <char id="94" x="100" y="253" width="19" height="14" xoffset="2" yoffset="7" xadvance="21" page="0" chnl="0" letter="^"/>
        <char id="95" x="55" y="273" width="18" height="4" xoffset="0" yoffset="32" xadvance="16" page="0" chnl="0" letter="_"/>
        <char id="96" x="21" y="273" width="10" height="7" xoffset="-2" yoffset="7" xadvance="8" page="0" chnl="0" letter="`"/>
        <char id="97" x="22" y="232" width="17" height="19" xoffset="1" yoffset="13" xadvance="17" page="0" chnl="0" letter="a"/>
        <char id="98" x="2" y="38" width="19" height="27" xoffset="2" yoffset="5" xadvance="20" page="0" chnl="0" letter="b"/>
        <char id="99" x="41" y="232" width="16" height="19" xoffset="1" yoffset="13" xadvance="15" page="0" chnl="0" letter="c"/>
        <char id="100" x="23" y="38" width="19" height="27" xoffset="1" yoffset="5" xadvance="20" page="0" chnl="0" letter="d"/>
        <char id="101" x="2" y="232" width="18" height="19" xoffset="1" yoffset="13" xadvance="18" page="0" chnl="0" letter="e"/>
        <char id="102" x="83" y="38" width="14" height="27" xoffset="0" yoffset="5" xadvance="11" page="0" chnl="0" letter="f"/>
        <char id="103" x="23" y="95" width="19" height="26" xoffset="1" yoffset="14" xadvance="20" page="0" chnl="0" letter="g"/>
        <char id="104" x="64" y="38" width="17" height="27" xoffset="2" yoffset="5" xadvance="18" page="0" chnl="0" letter="h"/>
        <char id="105" x="54" y="205" width="7" height="25" xoffset="2" yoffset="7" xadvance="8" page="0" chnl="0" letter="i"/>
        <char id="106" x="10" y="2" width="10" height="33" xoffset="-1" yoffset="7" xadvance="8" page="0" chnl="0" letter="j"/>
        <char id="107" x="44" y="38" width="18" height="27" xoffset="2" yoffset="5" xadvance="17" page="0" chnl="0" letter="k"/>
        <char id="108" x="99" y="38" width="6" height="27" xoffset="2" yoffset="5" xadvance="8" page="0" chnl="0" letter="l"/>
        <char id="109" x="106" y="232" width="26" height="18" xoffset="2" yoffset="14" xadvance="28" page="0" chnl="0" letter="m"/>
        <char id="110" x="2" y="253" width="17" height="18" xoffset="2" yoffset="14" xadvance="18" page="0" chnl="0" letter="n"/>
        <char id="111" x="154" y="205" width="19" height="19" xoffset="1" yoffset="13" xadvance="20" page="0" chnl="0" letter="o"/>
        <char id="112" x="44" y="95" width="19" height="26" xoffset="2" yoffset="13" xadvance="20" page="0" chnl="0" letter="p"/>
        <char id="113" x="65" y="95" width="19" height="26" xoffset="1" yoffset="13" xadvance="20" page="0" chnl="0" letter="q"/>
        <char id="114" x="58" y="253" width="12" height="18" xoffset="2" yoffset="14" xadvance="12" page="0" chnl="0" letter="r"/>
        <char id="115" x="59" y="232" width="15" height="19" xoffset="1" yoffset="13" xadvance="14" page="0" chnl="0" letter="s"/>
        <char id="116" x="63" y="205" width="14" height="23" xoffset="0" yoffset="9" xadvance="12" page="0" chnl="0" letter="t"/>
        <char id="117" x="21" y="253" width="17" height="18" xoffset="2" yoffset="14" xadvance="18" page="0" chnl="0" letter="u"/>
        <char id="118" x="156" y="232" width="19" height="18" xoffset="0" yoffset="14" xadvance="17" page="0" chnl="0" letter="v"/>
        <char id="119" x="76" y="232" width="28" height="18" xoffset="0" yoffset="14" xadvance="25" page="0" chnl="0" letter="w"/>
        <char id="120" x="134" y="232" width="20" height="18" xoffset="-0" yoffset="14" xadvance="17" page="0" chnl="0" letter="x"/>
        <char id="121" x="86" y="95" width="19" height="26" xoffset="0" yoffset="14" xadvance="17" page="0" chnl="0" letter="y"/>
        <char id="122" x="40" y="253" width="16" height="18" xoffset="1" yoffset="14" xadvance="15" page="0" chnl="0" letter="z"/>
        <char id="123" x="22" y="2" width="13" height="31" xoffset="0" yoffset="6" xadvance="9" page="0" chnl="0" letter="{"/>
        <char id="124" x="2" y="2" width="6" height="34" xoffset="2" yoffset="6" xadvance="7" page="0" chnl="0" letter="|"/>
        <char id="125" x="37" y="2" width="13" height="31" xoffset="-1" yoffset="6" xadvance="9" page="0" chnl="0" letter="}"/>
        <char id="126" x="2" y="273" width="17" height="8" xoffset="3" yoffset="17" xadvance="21" page="0" chnl="0" letter="~"/>
    </chars>
</font>