ID;SHA1;MD5;Ransomware_Family
1001;0d919f9a52182dbea2bfae50fa9bd90bd933274e;415c3277868d9be6d62f6155352ba9fb;0
1002;8fc6dd893d10eb3f4d7c06fda1d3e05a8c7ba8ad;2525d5867b27f5ee3949880186c35ed7;0
1003;6eda5da62e5073a67ff89dd89b85328dd2df73d1;41687e58130c8bdca248e1403e565afb;0
1004;60821226d8d934d488d4f8e8081c32c6a73f8929;ebd239b8b8fe486b2a13a5896a96d044;0
1005;34bf6d6f22a1db7297521e391a39f2916e794445;ef83cf24ea3987a840c41136c289028c;0
1006;3fbbe68b2c6063790d37a005dd5cabc7cca36149;6dc2584f29387000ee0b8e7188988cbd;1
1007;dc963d8beb490d00261280dc5a9bc9cc700da602;3013eb292b9942b03fb4fbc905195347;1
1008;c5acefee89cdbf24e99d311f804615aedef8f3df;9225bab1b05498fde1ff93de2fd03c0c;1
1009;087497940a41d96e4e907b6dc92f75f4a38d861a;aea5d3cced6725f37e2c3797735e6467;1
1010;f4cb3c0dac554e5dd4571f0a956dcd051de1579c;dc50f0961afdb4a3b8fa0309e92adbb4;1
1011;4d51f074c5c9f3db394d32fed5dc19423fed3cb2;5c88796f484799bcb72bd95f4de67729;2
1012;fbd06cab5fd64a2095b2a0c8b559da0dbc0d98c7;07bc722817c1aaaaf06a7a7f2429b7be;2
1013;b9c47e596e9066eff4c7758ed3e85d29fb052481;165c7812f74a8918378e8ea964135582;2
1014;2a35dbc6480a6834f3b506c50418c4e77472db06;a8cc764e7c7a62a0fc26bbe3df31daa6;2
1015;40b7b386c2c6944a6571c6dcfb23aaae026e8e82;f59d2a3c925f331aae7437dd7ac1a7c8;2
1016;6219bd0d064c0fffa91166c498d937cf066ec05e;1f50fa0d0f6c295a5db3568e9f0684c2;3
1017;f668b1110d8a6b1a3f638fd8a6276a7a1efe18db;2e8897ef38d4abe4861360a4b6e895d5;3
1018;14177730443c65aefeeda3162b324fdedf9cf9e0;223eff1610b432a1f1aa06c60bd7b9a6;3
1019;4948cc434de62b14c6a92fb8d15f6355199dd7f2;04910458c6338cd58027336c5a3e0f26;3
1020;bd793a30397a2d9bbc9773e4aaaf7d8ef01562e9;dada00d0d362e486625b1468621a255b;3
1021;6b0deb67a178fe20e81691133b257df3bafa3006;01492156ce8b4034c5b1027130f4cf4e;4
1022;aeaea352b9fe0236f281ce9456586ff39785fc74;99de8709cafc195cd12cfca75d35de4a;4
1023;5e8e33d63d1bafa02084d018aab73a392fdce984;a0e99a1ba424a8f967b13021b42fce9f;4
1024;04028a0a1d44f81709040c31af026785209d4343;afd5d656a42a746e95926ef07933f054;4
1025;db3163a09eb33ff4370ad162a05f4b2584a20456;df0b88dafe7a65295f99e69a67db9e1b;4
1026;8b5a21254a0c10e3ca2570eeba490755197b544e;4e93c194b641d9b849f270531ec14d20;5
1027;32afcdf6049e3095f54258943c972a0fb63f82e1;053f7fec073b37c4d2c3621165b06ace;5
1028;4790bde7c2d233c07165caaab0f5b7d69a60c950;127fe6658efb06e77b674fdb9db7d6d5;5
1029;c4f779d08633a53e7a03c702eafbe3314055aa18;498ee5cf9c611ba7ed2379414d0bb010;5
1030;aa7f29286a986017dddd768bfa984aa20b6a4767;a8da515ef614fed11f7f5f692398c8ef;5
1031;aa54013aeb502b4a936331deb76a6411f1f1ade7;0bf7bc20496143a9f028e77ab47b4698;6
1032;ff57cda4829978d8b6f7f1f31356f291b37acaa6;59db7bd22d4ec503b768ece646205c27;6
1033;1d30388c1235da56a2f17d645f0a66ead7b59159;a2086f41bc06adc69517bc0d9c07bf6e;6
1034;82f88c1af036181ee4e92a2f9338c152d1ff0c58;a292fee8d8db83711e72c06d6f82562d;6
1035;b1b3d7d20ccad8130723d5114c64b66afa8011d4;b113be47b5b601e0a58d774b4ce70a17;6
1036;e27521c7158c6af3aa58f78fcbed64b17c946f70;2cda932f5a9dafb0a328d0f9788bd89c;7
1037;221e45064829d5ca7852aa5421d5284986916d93;427eba9f6ff2cd312c72770f13e279c1;7
1038;8d635ca131d8aa20971744dcb30a9e2e1f8cd1be;503f112e243519a1b9e0344499561908;7
1039;0edf5e5feae982f3c564875ee01f82e5068f94ac;c0bee5d054345131355452ef0c057697;7
1040;f308c74c20d75c5f850cdc2468dfe54c3c31eccd;c2cbbd6e392a453a47da69d086756e71;7
1041;70d1d11e3b295ec6280ab33e7b129c17f40a6d2f;0c756fc8f34e409650cd910b5e2a3f00;8
1042;2084ae47dcdda6161c8697e995512448facba37c;2f90cd68e4a92c5151c6e43902397a13;8
1043;5409bd072cd857d94ff24cb8ede0c758689fbbf1;68d8a369cdf2e92c0f7ac2310f633b45;8
1044;e3baa1c3ee9aa1d5ae61187be2e20ea9cb57d538;36171704cde087f839b10c2465d864e1;8
1045;b7804d36820ee82a0946504976520b7b331e7ca3;fbdcee7e00cb64d9446d7074014a783e;8
1046;79a708e70747351688a3efdaf3b6ddb4afd24ef2;1acdaba338e67c748e56aa81a27a9831;9
1047;246813f9a57e030f109bb77742809e32bac89c04;617ccca7d5753993cbfd1309d1a18e1c;9
1048;d85a46b51b7cf9fe24783508e0739ccee3cf5874;193964c937493b979b1e9649a83ff000;9
1049;6559aca0e14b009012e73023f89f4b008b4ef61b;24519895e966596b910322cdf945562f;9
1050;a9a6cc3c766c63a95f30b2df2f7f612a1a6ca3fc;7400c96361c52256169263a41e9aa03e;9