[2017-11-12 6:07:23.819263] [info] ----------------------------------------------------------2017-11-12 06:07
    current_url: '//wip.timevn.com/wp-base/wp-cron.php?doing_wp_cron=1510441643.4566888809204101562500'
    user_id: 'Unknown'
    user_username: 'Unknown'
    user_email: 'Unknown'
    ip: '103.28.37.47'
    time: '2017-11-12 06:07'
    post: array()
    get: array(
        'doing_wp_cron' => '1510441643.4566888809204101562500',
    )
    ---: '---'
[2017-11-12 6:07:24.524806] [info] ----------------------------------------------------------2017-11-12 06:07
    current_url: '//wip.timevn.com/wp-base/'
    user_id: 'Unknown'
    user_username: 'Unknown'
    user_email: 'Unknown'
    ip: '216.119.142.90'
    time: '2017-11-12 06:07'
    post: array()
    get: array()
    ---: '---'
