[2017-08-21 8:47:46.559737] [info] ----------------------------------------------------------2017-08-21 08:47
    current_url: '//wip.timevn.com/wp-base/'
    user_id: 'Unknown'
    user_username: 'Unknown'
    user_email: 'Unknown'
    ip: '118.70.170.43'
    time: '2017-08-21 08:47'
    post: array()
    get: array()
    ---: '---'
