[2017-08-19 17:03:20.994317] [info] ----------------------------------------------------------2017-08-19 17:03
    current_url: '//wip.timevn.com/wp-base/'
    user_id: 'Unknown'
    user_username: 'Unknown'
    user_email: 'Unknown'
    ip: '101.99.23.83'
    time: '2017-08-19 17:03'
    post: array()
    get: array()
    ---: '---'
