[2017-10-19 11:35:58.119419] [info] ----------------------------------------------------------2017-10-19 11:35
    current_url: '//wip.timevn.com/wp-base/wp-cron.php?doing_wp_cron=1508387757.3537321090698242187500'
    user_id: 'Unknown'
    user_username: 'Unknown'
    user_email: 'Unknown'
    ip: '103.28.37.47'
    time: '2017-10-19 11:35'
    post: array()
    get: array(
        'doing_wp_cron' => '1508387757.3537321090698242187500',
    )
    ---: '---'
[2017-10-19 11:35:58.387181] [info] ----------------------------------------------------------2017-10-19 11:35
    current_url: '//wip.timevn.com/wp-base/'
    user_id: 'Unknown'
    user_username: 'Unknown'
    user_email: 'Unknown'
    ip: '216.119.142.90'
    time: '2017-10-19 11:35'
    post: array()
    get: array()
    ---: '---'
