2023-01-23 05:45:00,348 Number of classes: 21
2023-01-23 05:45:00,348 Number of train images: 3375
2023-01-23 05:45:00,348 Number of val images: 3375
2023-01-23 05:45:00,348 Classes names: ['0', '1', '2', '3', '4', '5', '6', '7', '8', '9', 'A', 'B', 'C', 'E', 'G', 'K', 'L', 'M', 'R', 'S', 'T']
2023-01-23 05:45:00,348 Model name: resnet50
2023-01-23 05:45:00,348 Crierion name: cross_entropy
2023-01-23 05:45:00,348 Optimizer name: sgd
2023-01-23 05:45:02,869 Epoch 0/49
2023-01-23 05:45:02,869 ----------
2023-01-23 05:45:43,748 train Loss: 2.8132 Acc: 0.1473
2023-01-23 05:45:56,501 val Loss: 2.6197 Acc: 0.1991
2023-01-23 05:45:56,524 Epoch 1/49
2023-01-23 05:45:56,524 ----------
2023-01-23 05:46:34,480 train Loss: 2.4152 Acc: 0.2945
2023-01-23 05:46:47,072 val Loss: 2.2048 Acc: 0.4012
2023-01-23 05:46:47,093 Epoch 2/49
2023-01-23 05:46:47,093 ----------
2023-01-23 05:47:25,315 train Loss: 1.9736 Acc: 0.4527
2023-01-23 05:47:37,839 val Loss: 1.7628 Acc: 0.5156
2023-01-23 05:47:37,859 Epoch 3/49
2023-01-23 05:47:37,860 ----------
2023-01-23 05:48:16,327 train Loss: 1.5758 Acc: 0.5650
2023-01-23 05:48:28,811 val Loss: 1.3767 Acc: 0.6296
2023-01-23 05:48:28,830 Epoch 4/49
2023-01-23 05:48:28,830 ----------
2023-01-23 05:49:06,886 train Loss: 1.2702 Acc: 0.6412
2023-01-23 05:49:19,386 val Loss: 1.0997 Acc: 0.7108
2023-01-23 05:49:19,406 Epoch 5/49
2023-01-23 05:49:19,406 ----------
2023-01-23 05:49:57,797 train Loss: 1.0270 Acc: 0.7108
2023-01-23 05:50:10,448 val Loss: 0.8974 Acc: 0.7559
2023-01-23 05:50:10,468 Epoch 6/49
2023-01-23 05:50:10,468 ----------
2023-01-23 05:50:48,647 train Loss: 0.9097 Acc: 0.7440
2023-01-23 05:51:01,149 val Loss: 0.8699 Acc: 0.7641
2023-01-23 05:51:01,169 Epoch 7/49
2023-01-23 05:51:01,169 ----------
2023-01-23 05:51:39,574 train Loss: 0.8795 Acc: 0.7490
2023-01-23 05:51:52,214 val Loss: 0.8501 Acc: 0.7680
2023-01-23 05:51:52,234 Epoch 8/49
2023-01-23 05:51:52,234 ----------
2023-01-23 05:52:30,624 train Loss: 0.8683 Acc: 0.7514
2023-01-23 05:52:43,203 val Loss: 0.8305 Acc: 0.7716
2023-01-23 05:52:43,223 Epoch 9/49
2023-01-23 05:52:43,223 ----------
2023-01-23 05:53:21,447 train Loss: 0.8312 Acc: 0.7633
2023-01-23 05:53:34,139 val Loss: 0.8170 Acc: 0.7816
2023-01-23 05:53:34,158 Epoch 10/49
2023-01-23 05:53:34,159 ----------
2023-01-23 05:54:12,596 train Loss: 0.8453 Acc: 0.7579
2023-01-23 05:54:25,250 val Loss: 0.8008 Acc: 0.7793
2023-01-23 05:54:25,251 Epoch 11/49
2023-01-23 05:54:25,251 ----------
2023-01-23 05:55:03,619 train Loss: 0.8247 Acc: 0.7656
2023-01-23 05:55:16,252 val Loss: 0.7829 Acc: 0.7896
2023-01-23 05:55:16,272 Epoch 12/49
2023-01-23 05:55:16,272 ----------
2023-01-23 05:55:54,436 train Loss: 0.8038 Acc: 0.7677
2023-01-23 05:56:07,022 val Loss: 0.7679 Acc: 0.7956
2023-01-23 05:56:07,042 Epoch 13/49
2023-01-23 05:56:07,042 ----------
2023-01-23 05:56:44,965 train Loss: 0.7933 Acc: 0.7766
2023-01-23 05:56:57,587 val Loss: 0.7704 Acc: 0.7926
2023-01-23 05:56:57,587 Epoch 14/49
2023-01-23 05:56:57,587 ----------
2023-01-23 05:57:35,938 train Loss: 0.7938 Acc: 0.7787
2023-01-23 05:57:48,558 val Loss: 0.7706 Acc: 0.7917
2023-01-23 05:57:48,558 Epoch 15/49
2023-01-23 05:57:48,558 ----------
2023-01-23 05:58:26,729 train Loss: 0.8016 Acc: 0.7757
2023-01-23 05:58:39,379 val Loss: 0.7637 Acc: 0.7950
2023-01-23 05:58:39,379 Epoch 16/49
2023-01-23 05:58:39,379 ----------
2023-01-23 05:59:17,754 train Loss: 0.7974 Acc: 0.7710
2023-01-23 05:59:30,281 val Loss: 0.7626 Acc: 0.7961
2023-01-23 05:59:30,301 Epoch 17/49
2023-01-23 05:59:30,301 ----------
2023-01-23 06:00:08,770 train Loss: 0.7989 Acc: 0.7721
2023-01-23 06:00:21,347 val Loss: 0.7627 Acc: 0.7932
2023-01-23 06:00:21,348 Epoch 18/49
2023-01-23 06:00:21,348 ----------
2023-01-23 06:00:59,500 train Loss: 0.8002 Acc: 0.7754
2023-01-23 06:01:12,184 val Loss: 0.7645 Acc: 0.7923
2023-01-23 06:01:12,185 Epoch 19/49
2023-01-23 06:01:12,185 ----------
2023-01-23 06:01:50,665 train Loss: 0.7917 Acc: 0.7713
2023-01-23 06:02:03,212 val Loss: 0.7601 Acc: 0.7953
2023-01-23 06:02:03,212 Epoch 20/49
2023-01-23 06:02:03,212 ----------
2023-01-23 06:02:41,618 train Loss: 0.7799 Acc: 0.7796
2023-01-23 06:02:54,048 val Loss: 0.7614 Acc: 0.7926
2023-01-23 06:02:54,049 Epoch 21/49
2023-01-23 06:02:54,049 ----------
2023-01-23 06:03:32,159 train Loss: 0.7960 Acc: 0.7656
2023-01-23 06:03:44,748 val Loss: 0.7576 Acc: 0.7929
2023-01-23 06:03:44,748 Epoch 22/49
2023-01-23 06:03:44,748 ----------
2023-01-23 06:04:22,837 train Loss: 0.7988 Acc: 0.7671
2023-01-23 06:04:35,467 val Loss: 0.7601 Acc: 0.7932
2023-01-23 06:04:35,467 Epoch 23/49
2023-01-23 06:04:35,467 ----------
2023-01-23 06:05:13,882 train Loss: 0.7894 Acc: 0.7748
2023-01-23 06:05:26,454 val Loss: 0.7615 Acc: 0.8006
2023-01-23 06:05:26,474 Epoch 24/49
2023-01-23 06:05:26,474 ----------
2023-01-23 06:06:04,722 train Loss: 0.7821 Acc: 0.7784
2023-01-23 06:06:17,174 val Loss: 0.7574 Acc: 0.7964
2023-01-23 06:06:17,174 Epoch 25/49
2023-01-23 06:06:17,174 ----------
2023-01-23 06:06:55,539 train Loss: 0.7890 Acc: 0.7754
2023-01-23 06:07:08,222 val Loss: 0.7605 Acc: 0.7953
2023-01-23 06:07:08,222 Epoch 26/49
2023-01-23 06:07:08,222 ----------
2023-01-23 06:07:46,352 train Loss: 0.7925 Acc: 0.7721
2023-01-23 06:07:58,963 val Loss: 0.7602 Acc: 0.7979
2023-01-23 06:07:58,963 Epoch 27/49
2023-01-23 06:07:58,963 ----------
2023-01-23 06:08:37,172 train Loss: 0.7905 Acc: 0.7754
2023-01-23 06:08:49,751 val Loss: 0.7613 Acc: 0.7932
2023-01-23 06:08:49,751 Epoch 28/49
2023-01-23 06:08:49,751 ----------
2023-01-23 06:09:28,134 train Loss: 0.7933 Acc: 0.7695
2023-01-23 06:09:40,683 val Loss: 0.7584 Acc: 0.7947
2023-01-23 06:09:40,684 Epoch 29/49
2023-01-23 06:09:40,684 ----------
2023-01-23 06:10:18,870 train Loss: 0.7977 Acc: 0.7716
2023-01-23 06:10:31,472 val Loss: 0.7594 Acc: 0.7959
2023-01-23 06:10:31,472 Epoch 30/49
2023-01-23 06:10:31,472 ----------
2023-01-23 06:11:09,720 train Loss: 0.7851 Acc: 0.7721
2023-01-23 06:11:22,349 val Loss: 0.7617 Acc: 0.7953
2023-01-23 06:11:22,349 Epoch 31/49
2023-01-23 06:11:22,349 ----------
2023-01-23 06:12:00,530 train Loss: 0.8003 Acc: 0.7606
2023-01-23 06:12:13,144 val Loss: 0.7608 Acc: 0.7970
2023-01-23 06:12:13,144 Epoch 32/49
2023-01-23 06:12:13,144 ----------
2023-01-23 06:12:51,313 train Loss: 0.7882 Acc: 0.7757
2023-01-23 06:13:03,874 val Loss: 0.7585 Acc: 0.7976
2023-01-23 06:13:03,875 Epoch 33/49
2023-01-23 06:13:03,875 ----------
2023-01-23 06:13:42,190 train Loss: 0.7919 Acc: 0.7719
2023-01-23 06:13:54,756 val Loss: 0.7609 Acc: 0.7920
2023-01-23 06:13:54,757 Epoch 34/49
2023-01-23 06:13:54,757 ----------
2023-01-23 06:14:32,912 train Loss: 0.7933 Acc: 0.7766
2023-01-23 06:14:45,336 val Loss: 0.7606 Acc: 0.7914
2023-01-23 06:14:45,336 Epoch 35/49
2023-01-23 06:14:45,336 ----------
2023-01-23 06:15:23,488 train Loss: 0.7856 Acc: 0.7801
2023-01-23 06:15:36,104 val Loss: 0.7609 Acc: 0.7967
2023-01-23 06:15:36,104 Epoch 36/49
2023-01-23 06:15:36,104 ----------
2023-01-23 06:16:14,209 train Loss: 0.7970 Acc: 0.7674
2023-01-23 06:16:26,560 val Loss: 0.7612 Acc: 0.7950
2023-01-23 06:16:26,560 Epoch 37/49
2023-01-23 06:16:26,560 ----------
2023-01-23 06:17:04,766 train Loss: 0.7866 Acc: 0.7810
2023-01-23 06:17:17,275 val Loss: 0.7615 Acc: 0.7988
2023-01-23 06:17:17,275 Epoch 38/49
2023-01-23 06:17:17,275 ----------
2023-01-23 06:17:55,418 train Loss: 0.7857 Acc: 0.7793
2023-01-23 06:18:08,047 val Loss: 0.7617 Acc: 0.7953
2023-01-23 06:18:08,047 Epoch 39/49
2023-01-23 06:18:08,047 ----------
2023-01-23 06:18:46,366 train Loss: 0.7882 Acc: 0.7760
2023-01-23 06:18:58,972 val Loss: 0.7586 Acc: 0.7985
2023-01-23 06:18:58,972 Epoch 40/49
2023-01-23 06:18:58,972 ----------
2023-01-23 06:19:37,130 train Loss: 0.7846 Acc: 0.7710
2023-01-23 06:19:49,746 val Loss: 0.7578 Acc: 0.7997
2023-01-23 06:19:49,746 Epoch 41/49
2023-01-23 06:19:49,746 ----------
2023-01-23 06:20:28,166 train Loss: 0.7890 Acc: 0.7745
2023-01-23 06:20:40,793 val Loss: 0.7625 Acc: 0.7923
2023-01-23 06:20:40,793 Epoch 42/49
2023-01-23 06:20:40,793 ----------
2023-01-23 06:21:19,112 train Loss: 0.7863 Acc: 0.7784
2023-01-23 06:21:31,770 val Loss: 0.7577 Acc: 0.7976
2023-01-23 06:21:31,771 Epoch 43/49
2023-01-23 06:21:31,771 ----------
2023-01-23 06:22:09,898 train Loss: 0.7980 Acc: 0.7793
2023-01-23 06:22:22,524 val Loss: 0.7596 Acc: 0.7964
2023-01-23 06:22:22,524 Epoch 44/49
2023-01-23 06:22:22,525 ----------
2023-01-23 06:23:00,703 train Loss: 0.7907 Acc: 0.7736
2023-01-23 06:23:13,319 val Loss: 0.7572 Acc: 0.7938
2023-01-23 06:23:13,319 Epoch 45/49
2023-01-23 06:23:13,319 ----------
2023-01-23 06:23:51,639 train Loss: 0.7882 Acc: 0.7698
2023-01-23 06:24:04,242 val Loss: 0.7587 Acc: 0.7961
2023-01-23 06:24:04,242 Epoch 46/49
2023-01-23 06:24:04,243 ----------
2023-01-23 06:24:42,462 train Loss: 0.7894 Acc: 0.7745
2023-01-23 06:24:55,002 val Loss: 0.7611 Acc: 0.7929
2023-01-23 06:24:55,002 Epoch 47/49
2023-01-23 06:24:55,002 ----------
2023-01-23 06:25:33,128 train Loss: 0.7975 Acc: 0.7730
2023-01-23 06:25:45,625 val Loss: 0.7615 Acc: 0.7938
2023-01-23 06:25:45,626 Epoch 48/49
2023-01-23 06:25:45,626 ----------
2023-01-23 06:26:23,845 train Loss: 0.7847 Acc: 0.7790
2023-01-23 06:26:36,436 val Loss: 0.7585 Acc: 0.7976
2023-01-23 06:26:36,436 Epoch 49/49
2023-01-23 06:26:36,436 ----------
2023-01-23 06:27:14,444 train Loss: 0.7925 Acc: 0.7686
2023-01-23 06:27:26,959 val Loss: 0.7559 Acc: 0.7970
2023-01-23 06:27:26,960 Training complete in 42m 24s
2023-01-23 06:27:26,960 Best val Acc: 0.800593
