{
  "project_info": {
    "project_number": "934864502401",
    "firebase_url": "https://android01demo.firebaseio.com",
    "project_id": "android01demo",
    "storage_bucket": "android01demo.appspot.com"
  },
  "client": [
    {
      "client_info": {
        "mobilesdk_app_id": "1:934864502401:android:009535c2dde1eb83",
        "android_client_info": {
          "package_name": "com.janeto.jtc.bai15"
        }
      },
      "oauth_client": [
        {
          "client_id": "934864502401-48liu651ci178okb81urh7p4og4fllv2.apps.googleusercontent.com",
          "client_type": 1,
          "android_info": {
            "package_name": "com.janeto.jtc.bai15",
            "certificate_hash": "1f08e8a6dc6bbe44c16a74b0ae4f8db8219c84b4"
          }
        },
        {
          "client_id": "934864502401-manirenvf85cgbmdc1s7tqo1mme0ufkn.apps.googleusercontent.com",
          "client_type": 3
        }
      ],
      "api_key": [
        {
          "current_key": "AIzaSyACrCYVh-gqUzj0UIgfL2g8adwazF7jG3g"
        }
      ],
      "services": {
        "analytics_service": {
          "status": 1
        },
        "appinvite_service": {
          "status": 2,
          "other_platform_oauth_client": [
            {
              "client_id": "934864502401-manirenvf85cgbmdc1s7tqo1mme0ufkn.apps.googleusercontent.com",
              "client_type": 3
            }
          ]
        },
        "ads_service": {
          "status": 2
        }
      }
    }
  ],
  "configuration_version": "1"
}