{
  "collectionName": "components_order_items",
  "info": {
    "name": "Item",
    "icon": "cube"
  },
  "options": {},
  "attributes": {
    "product": {
      "unique": true,
      "model": "variant"
    },
    "amount": {
      "type": "integer",
      "min": 0,
      "required": true
    }
  }
}
