{
    "repoUrl": "https://gitlab.com/hanaloop/branding/hanaloop.com",
    "repoDefaultBranch": "main",
    "rootUrl": "https://hanaloop.gitlab.com/hanaloop.com",

    "name": "HanaLoop",
    "logoUrl": "/images/hanaloop-icon.png",
    "faviconUrl": "/images/logo.ico",
    "googleTagId": "", 

    "defaultLang": "en",
    "langs": [{ 
            "id": "en",
            "name": "English"
        },{ 
            "id": "ko",
            "name": "한국어"
        }]

}
