[
  {
    "_type": "item",
    "slug": "/docs/_index",
    "meta": {
      "title": "환경 자료",
      "description": "환경관련 자료",
      "publishedAt": "2022-01-11",
      "summary": "Document Home for demo purpose!",
      "image": "/images/pexels-photo-414798.jpeg",
      "author": "hykim",
      "tags": [
        "Document"
      ],
      "readingTime": {
        "text": "1 min read",
        "minutes": 0.25,
        "time": 15000,
        "words": 50
      },
      "contentFull": "\n## 환경 관련 자료\n\nThis is the index document.\n\n> Note: the file name is `_index.md`\n"
    }
  },
  {
    "_type": "item",
    "slug": "/docs/glossary",
    "meta": {
      "title": "용어",
      "description": "환경 용어",
      "publishedAt": "2022-10-10",
      "summary": "환경 용어",
      "author": "hykim",
      "tags": [
        "용어"
      ],
      "image": "/images/bg-hero_book.jpeg",
      "readingTime": {
        "text": "1 min read",
        "minutes": 0.575,
        "time": 34500,
        "words": 115
      },
      "contentFull": "\nimport data from \"../content/docs/glossary.data\";\n\n## 환경 관련 용어\n\n<div className=\"[word-break:keep-all]\">\n\n<div className=\"text-left space-y-4 text-sm \">\n{data.termsKo.map(term => \n  <div className=\"flex align-top bg-gray-100 border hover:border-lime-600\" key={term.title}>\n    <div className=\"p-2 flex-initial w-64\">{term.title}</div>\n    <div className=\"p-2 flex-1 bg-white\">{term.description}\n      {term.source && <span className=\"text-xs\">\n      [출저: <a href={term.sourceUrl}>{term.source}</a>]\n      </span>} \n    </div>\n  </div>\n)}\n</div>\n\n<div className=\"mt-4 text-left space-y-4 text-sm \">\n{data.terms.map(term => \n  <div className=\"flex align-top bg-gray-100 border hover:border-lime-600\" key={term.title}>\n    <div className=\"p-2 flex-initial w-64\">{term.title}</div>\n    <div className=\"p-2 flex-1 bg-white\">{term.description}\n      {term.source && <span className=\"text-xs\">\n      [출저: <a href={term.sourceUrl}>{term.source}</a>]\n      </span>} \n    </div>\n  </div>\n)}\n</div>\n\n</div>\n"
    }
  },
  {
    "_type": "item",
    "slug": "/docs/news/doc-s11",
    "meta": {
      "title": "환경소식",
      "publishedAt": "2022-01-11",
      "summary": "환경소식 입니다",
      "image": "https://images.pexels.com/photos/60013/desert-drought-dehydrated-clay-soil-60013.jpeg",
      "author": "ysahnpark",
      "tags": [
        "Document",
        "Demo"
      ],
      "readingTime": {
        "text": "1 min read",
        "minutes": 0.195,
        "time": 11700,
        "words": 39
      },
      "contentFull": "\n## Doc Level\n\nI am glad that you can see this!\n"
    }
  },
  {
    "_type": "item",
    "slug": "/docs/regulations/doc-kets",
    "meta": {
      "title": "한국 배출권거래제",
      "publishedAt": "2022-01-11",
      "summary": "배출권거래제",
      "image": "/images/pexels-photo-414798.jpeg",
      "author": "hykim",
      "tags": [
        "배출권거래제",
        "목표관리제"
      ],
      "readingTime": {
        "text": "1 min read",
        "minutes": 0.265,
        "time": 15900,
        "words": 53
      },
      "contentFull": "\n## 한국 배출권거래제 및 목표관리제 ETS \n\n\n"
    }
  },
  {
    "_type": "item",
    "slug": "/docs/standards/doc-s1",
    "meta": {
      "title": "First doc",
      "publishedAt": "2022-01-11",
      "summary": "First document for demo purpose!",
      "author": "ysahnpark",
      "tags": [
        "Document",
        "Demo"
      ],
      "readingTime": {
        "text": "1 min read",
        "minutes": 0.155,
        "time": 9300,
        "words": 31
      },
      "contentFull": "\n## Demo doc\n\nI am glad that you can see this!\n"
    }
  }
]