module efishery-scheduller

go 1.13

require (
	github.com/dgrijalva/jwt-go v3.2.0+incompatible // indirect
	github.com/go-redis/redis v6.15.9+incompatible
	github.com/go-redis/redis/v8 v8.0.0-beta.8
	github.com/jinzhu/gorm v1.9.16
	github.com/joho/godotenv v1.3.0
	github.com/labstack/echo v3.3.10+incompatible
	github.com/labstack/gommon v0.3.0
	github.com/robfig/cron v1.2.0
	github.com/robfig/cron/v3 v3.0.0 // indirect
	golang.org/x/crypto v0.0.0-20200820211705-5c72a883971a // indirect
	golang.org/x/lint v0.0.0-20190313153728-d0100b6bd8b3 // indirect
	honnef.co/go/tools v0.0.0-20190523083050-ea95bdfd59fc // indirect
)
