module bobobox-api

go 1.13

require (
	github.com/dgrijalva/jwt-go v3.2.0+incompatible
	github.com/go-redis/redis v6.15.9+incompatible
	github.com/jinzhu/gorm v1.9.16
	github.com/joho/godotenv v1.3.0
	github.com/labstack/echo v3.3.10+incompatible
	github.com/labstack/gommon v0.3.0 // indirect
	github.com/valyala/fasttemplate v1.2.1 // indirect
	golang.org/x/crypto v0.0.0-20200820211705-5c72a883971a
)
