{
  "build": {
    "dockerfile": "Dockerfile",
    "target": "debian-development"
  },
  "extensions": [
    "be5invis.toml",
    "davidanson.vscode-markdownlint",
    "eamodio.gitlens",
    "editorconfig.editorconfig",
    "exiasr.hadolint",
    "gitlab.gitlab-workflow",
    "gruntfuggly.todo-tree",
    "matklad.rust-analyzer",
    "mhutchie.git-graph",
    "ms-vsliveshare.vsliveshare-pack",
    "panicbit.cargo",
    "redhat.vscode-yaml",
    "richie5um2.vscode-sort-json",
    "serayuzgur.crates",
    "sleistner.vscode-fileutils",
    "sonarsource.sonarlint-vscode",
    "swellaby.vscode-rust-test-adapter",
    "vadimcn.vscode-lldb",
    "valentjn.vscode-ltex",
    "yzhang.markdown-all-in-one"
  ],
  "name": "Rust",
  "mounts": [
    "source=rust_vscodeserver,target=/root/.vscode-server/,type=volume",
    "source=rust_materials_vscodeserver-insiders,target=/root/.vscode-server-insiders/,type=volume",
    "source=${localEnv:HOME}${localEnv:USERPROFILE}/.config/git,target=/root/.config/git,type=bind,consistency=consistent,readonly"
  ],
  "runArgs": [
    // TODO: Does not work yet under Docker/Linux.
    // "--sysctl=kernel.perf_event_paranoid=1",
    "--cap-add=SYS_ADMIN",
    "--cap-add=SYS_PTRACE",
    "--security-opt",
    "seccomp=unconfined",
    "--privileged"
  ],
  "settings": {
    "rust-analyzer.updates.askBeforeDownload": false,
    "lldb.verboseLogging": true
    // TODO: For Alpine-based debugging
    // "lldb.library": "/usr/lib/liblldb.so.11.1.0"
  },
  "workspaceMount": "source=${localWorkspaceFolder},target=${localWorkspaceFolder},type=bind,consistency=delegated",
  "workspaceFolder": "${localWorkspaceFolder}"
}
