{
  "build": {
    "dockerfile": "../.gitpod.Dockerfile"
  },
  "extensions": [
	"dotjoshjohnson.xml",
	"eamodio.gitlens",
	"mhutchie.git-graph",
	"ms-vsliveshare.vsliveshare",
	"richardwillis.vscode-gradle-extension-pack",
	"richardwillis.vscode-spotless-gradle",
	"richie5um2.vscode-sort-json",
	"sleistner.vscode-fileutils",
	"valentjn.vscode-ltex",
	"vscjava.vscode-java-pack",
	"editorconfig.editorconfig"
],
  "mounts": [
    "source=${localEnv:HOME}${localEnv:USERPROFILE}/.config/git,target=/home/gitpod/.config/git,type=bind,consistency=cached,readonly"
  ],
  "name": "Java",
  "remoteEnv": {
    "GRADLE_USER_HOME": "${containerEnv:HOME}/.gradle",
    "USER_HOME": "${containerEnv:HOME}"
  },
  "settings": {
    "[java]": {
      "editor.codeActionsOnSave": {
        "source.fixAll.spotlessGradle": true
      },
      "editor.rulers": [
        100
      ],
      "spotlessGradle.diagnostics.enable": true,
      "spotlessGradle.format.enable": true
    },
    "gradle.autoDetect": "on",
    "java.configuration.updateBuildConfiguration": "automatic",
    "java.format.settings.url": "eclipse-java-google-style.xml",
    "java.home": "/home/gitpod/.sdkman/candidates/java/current",
    "java.import.gradle.home": "${containerEnv:GRADLE_USER_HOME}",
    "java.import.gradle.version": "7.2",
    "java.import.gradle.wrapper.enable": false,
    "ltex.language": "nl",
    "workbench.colorCustomizations": {
      "activityBar.background": "#283021",
      "titleBar.activeBackground": "#38432E",
      "titleBar.activeForeground": "#FAFBF9"
    }
  }
}