C:\Users\hamza\Music\assurance-back\BackEndInsurance\insurance-application\src\main\java\fr\sparkit\insurance\application\MainApplication.java
C:\Users\hamza\Music\assurance-back\BackEndInsurance\insurance-application\src\main\java\fr\sparkit\insurance\config\SimpleCorsFilter.java
C:\Users\hamza\Music\assurance-back\BackEndInsurance\insurance-application\src\main\java\fr\sparkit\insurance\config\SwaggerConfig.java
C:\Users\hamza\Music\assurance-back\BackEndInsurance\insurance-application\src\main\java\fr\sparkit\insurance\config\WebSecurityConfig.java
C:\Users\hamza\Music\assurance-back\BackEndInsurance\insurance-application\src\main\java\ResourceConfigue\WebConfiguration.java
C:\Users\hamza\Music\assurance-back\BackEndInsurance\insurance-application\src\main\java\fr\sparkit\insurance\config\WebSocketConfig.java
C:\Users\hamza\Music\assurance-back\BackEndInsurance\insurance-application\src\main\java\fr\sparkit\insurance\config\ResourceServerConfig.java
