22-08-2021 11:32:40.0659|ERROR|Custom Exception Notification => error code : 40100 , details : []
22-08-2021 15:06:43.0346|ERROR|Custom Exception Notification => error code : 40100 , details : []
22-08-2021 15:14:59.0955|ERROR|Custom Exception Notification => error code : 40100 , details : []
22-08-2021 15:15:06.0937|ERROR|Custom Exception Notification => error code : 40100 , details : []
22-08-2021 15:15:22.0463|ERROR|Custom Exception Notification => error code : 40100 , details : []
22-08-2021 15:16:05.0029|ERROR|Custom Exception Notification => error code : 40100 , details : []
22-08-2021 15:16:15.0157|ERROR|Custom Exception Notification => error code : 40100 , details : []
22-08-2021 15:31:45.0364|ERROR|Custom Exception Notification => error code : 40100 , details : []
