; ModuleID = 'probe6.67ab3e1a-cgu.0'
source_filename = "probe6.67ab3e1a-cgu.0"
target datalayout = "e-m:w-p270:32:32-p271:32:32-p272:64:64-i64:64-f80:128-n8:16:32:64-S128"
target triple = "x86_64-pc-windows-gnu"

; std::f64::<impl f64>::copysign
; Function Attrs: inlinehint uwtable
define internal double @"_ZN3std3f6421_$LT$impl$u20$f64$GT$8copysign17h5ea851c15408a9ceE"(double %self, double %sign) unnamed_addr #0 {
start:
  %0 = alloca double, align 8
  %1 = call double @llvm.copysign.f64(double %self, double %sign)
  store double %1, ptr %0, align 8
  %2 = load double, ptr %0, align 8
  br label %bb1

bb1:                                              ; preds = %start
  ret double %2
}

; probe6::probe
; Function Attrs: uwtable
define void @_ZN6probe65probe17h2a0c909ff383c8e0E() unnamed_addr #1 {
start:
; call std::f64::<impl f64>::copysign
  %_1 = call double @"_ZN3std3f6421_$LT$impl$u20$f64$GT$8copysign17h5ea851c15408a9ceE"(double 1.000000e+00, double -1.000000e+00)
  br label %bb1

bb1:                                              ; preds = %start
  ret void
}

; Function Attrs: nocallback nofree nosync nounwind readnone speculatable willreturn
declare double @llvm.copysign.f64(double, double) #2

attributes #0 = { inlinehint uwtable "target-cpu"="x86-64" }
attributes #1 = { uwtable "target-cpu"="x86-64" }
attributes #2 = { nocallback nofree nosync nounwind readnone speculatable willreturn }

!llvm.module.flags = !{!0}

!0 = !{i32 7, !"PIC Level", i32 2}
