; ModuleID = 'probe2.6109820e-cgu.0'
source_filename = "probe2.6109820e-cgu.0"
target datalayout = "e-m:w-p270:32:32-p271:32:32-p272:64:64-i64:64-f80:128-n8:16:32:64-S128"
target triple = "x86_64-pc-windows-gnu"

; probe2::probe
; Function Attrs: uwtable
define void @_ZN6probe25probe17hac59d0d8b58b64caE() unnamed_addr #0 {
start:
  ret void
}

attributes #0 = { uwtable "target-cpu"="x86-64" }

!llvm.module.flags = !{!0}

!0 = !{i32 7, !"PIC Level", i32 2}
