<?xml version="1.0" encoding="ASCII"?>
<sdkproject:SdkProject xmi:version="2.0" xmlns:xmi="http://www.omg.org/XMI" xmlns:xsi="http://www.w3.org/2001/XMLSchema-instance" xmlns:sdkproject="http://www.xilinx.com/sdkproject" name="rpu_ipi" location="C:/Hamza/Mixed_Criticality/workspace/vitis/rpu_ipi" platform="C:/Hamza/Mixed_Criticality/workspace/vitis/Base_Zynq_MPSoC_wrapper_3/export/Base_Zynq_MPSoC_wrapper_3/Base_Zynq_MPSoC_wrapper_3.xpfm" platformUID="xilinx:zcu102::0.0(custom)" systemProject="rpu_ipi_system" sysConfig="Base_Zynq_MPSoC_wrapper_3" runtime="cpp" cpu="standalone_domain" cpuInstance="psu_cortexr5_0" os="standalone" mssSignature="f73cde85469551b27068de7dbdbef01b">
  <configuration name="Debug" id="xilinx.gnu.arm.r5.exe.debug.1559716097">
    <configBuildOptions xsi:type="sdkproject:SdkOptions"/>
    <lastBuildOptions xsi:type="sdkproject:SdkOptions"/>
  </configuration>
  <configuration name="Release" id="xilinx.gnu.arm.r5.exe.release.801825033" dirty="true">
    <configBuildOptions xsi:type="sdkproject:SdkOptions"/>
  </configuration>
  <template appTemplateName="empty_application"/>
</sdkproject:SdkProject>
