<?xml version="1.0" encoding="UTF-8"?>
<session version="1.0">
<refactoring comment="Delete 2 resources" deleteContents="true" description="Delete 2 resources" element1="/RTOSDemo_R5_system" element2="/ZynqMP_ZCU102_platform_1" flags="7" id="org.eclipse.ltk.core.refactoring.delete.resources" resources="2" stamp="1637045215049"/>
</session>