$date
        2021-Dec-23 20:57:57
$end
$version
        Vivado v2019.2 (64-bit)
$end
$timescale
        1ps
$end
$scope module dut $end
$var reg 64 " i_ariane/i_frontend/npc_d [63:0] $end
$var reg 64 b i_ariane/i_frontend/npc_q [63:0] $end
$var reg 1 D" _TRIGGER $end
$var reg 1 E" _WINDOW $end
$var reg 1 F" _GAP $end
$upscope $end
$enddefinitions $end
#0
$dumpvars
b10000000000000000000000000010100 "
b10000000000000000000000000010000 b
0D"
1E"
0F"
$end
#1
b10000000001000000 "
b10000000000000000000000000010100 b
#2
b10000000001000100 "
b10000000001000000 b
#3
b10000000001000100 b
#15
b10000000001001000 "
#16
b10000000001001000 b
#28
b10000000001001100 "
#29
b10000000001001100 b
#41
b10000000001010000 "
#42
b10000000001010000 b
#54
b10000000001010100 "
#55
b10000000001010100 b
#67
b10000000001011000 "
#68
b10000000001011000 b
#80
b10000000000000000000000000000100 "
#81
b10000000000000000000000000001000 "
b10000000000000000000000000000100 b
#82
b10000000000000000000000000001100 "
b10000000000000000000000000001000 b
#83
b10000000000000000000000000010000 "
b10000000000000000000000000001100 b
#84
b10000000000000000000000000010100 "
b10000000000000000000000000010000 b
#85
b10000000001000000 "
b10000000000000000000000000010100 b
#86
b10000000001000100 "
b10000000001000000 b
#87
b10000000001000100 b
#99
b10000000001001000 "
#100
b10000000001001000 b
#112
b10000000001001100 "
#113
b10000000001001100 b
#125
b10000000001010000 "
#126
b10000000001010000 b
#138
b10000000001010100 "
#139
b10000000001010100 b
#151
b10000000001011000 "
#152
b10000000001011000 b
#164
b10000000000000000000000000000100 "
#165
b10000000000000000000000000001000 "
b10000000000000000000000000000100 b
#166
b10000000000000000000000000001100 "
b10000000000000000000000000001000 b
#167
b10000000000000000000000000010000 "
b10000000000000000000000000001100 b
#168
b10000000000000000000000000010100 "
b10000000000000000000000000010000 b
#169
b10000000001000000 "
b10000000000000000000000000010100 b
#170
b10000000001000100 "
b10000000001000000 b
#171
b10000000001000100 b
#183
b10000000001001000 "
#184
b10000000001001000 b
#196
b10000000001001100 "
#197
b10000000001001100 b
#209
b10000000001010000 "
#210
b10000000001010000 b
#222
b10000000001010100 "
#223
b10000000001010100 b
#235
b10000000001011000 "
#236
b10000000001011000 b
#248
b10000000000000000000000000000100 "
#249
b10000000000000000000000000001000 "
b10000000000000000000000000000100 b
#250
b10000000000000000000000000001100 "
b10000000000000000000000000001000 b
#251
b10000000000000000000000000010000 "
b10000000000000000000000000001100 b
#252
b10000000000000000000000000010100 "
b10000000000000000000000000010000 b
#253
b10000000001000000 "
b10000000000000000000000000010100 b
#254
b10000000001000100 "
b10000000001000000 b
#255
b10000000001000100 b
#267
b10000000001001000 "
#268
b10000000001001000 b
#280
b10000000001001100 "
#281
b10000000001001100 b
#293
b10000000001010000 "
#294
b10000000001010000 b
#306
b10000000001010100 "
#307
b10000000001010100 b
#319
b10000000001011000 "
#320
b10000000001011000 b
#332
b10000000000000000000000000000100 "
#333
b10000000000000000000000000001000 "
b10000000000000000000000000000100 b
#334
b10000000000000000000000000001100 "
b10000000000000000000000000001000 b
#335
b10000000000000000000000000010000 "
b10000000000000000000000000001100 b
#336
b10000000000000000000000000010100 "
b10000000000000000000000000010000 b
#337
b10000000001000000 "
b10000000000000000000000000010100 b
#338
b10000000001000100 "
b10000000001000000 b
#339
b10000000001000100 b
#351
b10000000001001000 "
#352
b10000000001001000 b
#364
b10000000001001100 "
#365
b10000000001001100 b
#377
b10000000001010000 "
#378
b10000000001010000 b
#390
b10000000001010100 "
#391
b10000000001010100 b
#403
b10000000001011000 "
#404
b10000000001011000 b
#416
b10000000000000000000000000000100 "
#417
b10000000000000000000000000001000 "
b10000000000000000000000000000100 b
#418
b10000000000000000000000000001100 "
b10000000000000000000000000001000 b
#419
b10000000000000000000000000010000 "
b10000000000000000000000000001100 b
#420
b10000000000000000000000000010100 "
b10000000000000000000000000010000 b
#421
b10000000001000000 "
b10000000000000000000000000010100 b
#422
b10000000001000100 "
b10000000001000000 b
#423
b10000000001000100 b
#435
b10000000001001000 "
#436
b10000000001001000 b
#448
b10000000001001100 "
#449
b10000000001001100 b
#461
b10000000001010000 "
#462
b10000000001010000 b
#474
b10000000001010100 "
#475
b10000000001010100 b
#487
b10000000001011000 "
#488
b10000000001011000 b
#500
b10000000000000000000000000000100 "
#501
b10000000000000000000000000001000 "
b10000000000000000000000000000100 b
#502
b10000000000000000000000000001100 "
b10000000000000000000000000001000 b
#503
b10000000000000000000000000010000 "
b10000000000000000000000000001100 b
#504
b10000000000000000000000000010100 "
b10000000000000000000000000010000 b
#505
b10000000001000000 "
b10000000000000000000000000010100 b
#506
b10000000001000100 "
b10000000001000000 b
#507
b10000000001000100 b
#512
1D"
#519
b10000000001001000 "
#520
b10000000001001000 b
#532
b10000000001001100 "
#533
b10000000001001100 b
#545
b10000000001010000 "
#546
b10000000001010000 b
#558
b10000000001010100 "
#559
b10000000001010100 b
#571
b10000000001011000 "
#572
b10000000001011000 b
#584
b10000000000000000000000000000100 "
#585
b10000000000000000000000000001000 "
b10000000000000000000000000000100 b
#586
b10000000000000000000000000001100 "
b10000000000000000000000000001000 b
#587
b10000000000000000000000000010000 "
b10000000000000000000000000001100 b
#588
b10000000000000000000000000010100 "
b10000000000000000000000000010000 b
#589
b10000000001000000 "
b10000000000000000000000000010100 b
#590
b10000000001000100 "
b10000000001000000 b
#591
b10000000001000100 b
#603
b10000000001001000 "
#604
b10000000001001000 b
#616
b10000000001001100 "
#617
b10000000001001100 b
#629
b10000000001010000 "
#630
b10000000001010000 b
#642
b10000000001010100 "
#643
b10000000001010100 b
#655
b10000000001011000 "
#656
b10000000001011000 b
#668
b10000000000000000000000000000100 "
#669
b10000000000000000000000000001000 "
b10000000000000000000000000000100 b
#670
b10000000000000000000000000001100 "
b10000000000000000000000000001000 b
#671
b10000000000000000000000000010000 "
b10000000000000000000000000001100 b
#672
b10000000000000000000000000010100 "
b10000000000000000000000000010000 b
#673
b10000000001000000 "
b10000000000000000000000000010100 b
#674
b10000000001000100 "
b10000000001000000 b
#675
b10000000001000100 b
#687
b10000000001001000 "
#688
b10000000001001000 b
#700
b10000000001001100 "
#701
b10000000001001100 b
#713
b10000000001010000 "
#714
b10000000001010000 b
#726
b10000000001010100 "
#727
b10000000001010100 b
#739
b10000000001011000 "
#740
b10000000001011000 b
#752
b10000000000000000000000000000100 "
#753
b10000000000000000000000000001000 "
b10000000000000000000000000000100 b
#754
b10000000000000000000000000001100 "
b10000000000000000000000000001000 b
#755
b10000000000000000000000000010000 "
b10000000000000000000000000001100 b
#756
b10000000000000000000000000010100 "
b10000000000000000000000000010000 b
#757
b10000000001000000 "
b10000000000000000000000000010100 b
#758
b10000000001000100 "
b10000000001000000 b
#759
b10000000001000100 b
#771
b10000000001001000 "
#772
b10000000001001000 b
#784
b10000000001001100 "
#785
b10000000001001100 b
#797
b10000000001010000 "
#798
b10000000001010000 b
#810
b10000000001010100 "
#811
b10000000001010100 b
#823
b10000000001011000 "
#824
b10000000001011000 b
#836
b10000000000000000000000000000100 "
#837
b10000000000000000000000000001000 "
b10000000000000000000000000000100 b
#838
b10000000000000000000000000001100 "
b10000000000000000000000000001000 b
#839
b10000000000000000000000000010000 "
b10000000000000000000000000001100 b
#840
b10000000000000000000000000010100 "
b10000000000000000000000000010000 b
#841
b10000000001000000 "
b10000000000000000000000000010100 b
#842
b10000000001000100 "
b10000000001000000 b
#843
b10000000001000100 b
#855
b10000000001001000 "
#856
b10000000001001000 b
#868
b10000000001001100 "
#869
b10000000001001100 b
#881
b10000000001010000 "
#882
b10000000001010000 b
#894
b10000000001010100 "
#895
b10000000001010100 b
#907
b10000000001011000 "
#908
b10000000001011000 b
#920
b10000000000000000000000000000100 "
#921
b10000000000000000000000000001000 "
b10000000000000000000000000000100 b
#922
b10000000000000000000000000001100 "
b10000000000000000000000000001000 b
#923
b10000000000000000000000000010000 "
b10000000000000000000000000001100 b
#924
b10000000000000000000000000010100 "
b10000000000000000000000000010000 b
#925
b10000000001000000 "
b10000000000000000000000000010100 b
#926
b10000000001000100 "
b10000000001000000 b
#927
b10000000001000100 b
#939
b10000000001001000 "
#940
b10000000001001000 b
#952
b10000000001001100 "
#953
b10000000001001100 b
#965
b10000000001010000 "
#966
b10000000001010000 b
#978
b10000000001010100 "
#979
b10000000001010100 b
#991
b10000000001011000 "
#992
b10000000001011000 b
#1004
b10000000000000000000000000000100 "
#1005
b10000000000000000000000000001000 "
b10000000000000000000000000000100 b
#1006
b10000000000000000000000000001100 "
b10000000000000000000000000001000 b
#1007
b10000000000000000000000000010000 "
b10000000000000000000000000001100 b
#1008
b10000000000000000000000000010100 "
b10000000000000000000000000010000 b
#1009
b10000000001000000 "
b10000000000000000000000000010100 b
#1010
b10000000001000100 "
b10000000001000000 b
#1011
b10000000001000100 b
#1023
b10000000001001000 "
