{
    "styles":
    {
        "@common":
        {
            "font":
            {
                "fontSize": 90,
                "fontFamily": "Times New Roman",
                "color": "black",
                
                "verticalAlignment": "Center"
            }
        },
        
        "@title":
        {
            "style": "@common",
            "font":
            {
                "fontFamily": "Bodoni MT",
                "fontSize": 285,
                "bold": true,
                "color": "white",
                
                "capitalization": "SmallCaps",
                "horizontalAlignment": "Center",
                "verticalAlignment": "Top",
            }
        },
        
        "@titleShade":
        {
            "style": "@title",
            "font": { "color": "black" }
        },
        
        "@subtitle":
        {
            "style": "@title",
            "font":
            {
                "fontSize": 100
            }
        },
        
        "@subtitleShade":
        {
            "style": "@subtitle",
            "font": { "color": "black" }
        },
        
        "@stats":
        {
            "font":
            {
                "fontSize": 110,
                "fontFamily": "Constantia",
                "color": "white",
                "bold": true
            }
        },
        
        "@weapons":
        {
            "style": "@common",
            "font":
            {
                "fontSize": 70,
                "bold": true,
                "horizontalAlignment": "Center",
            }
        },
        
        "@rules":
        {
            "style": "@common",
            "font":
            {
                "fontSize": 90,
                "paragraphVerticalSpace": 50,
                "verticalSpaceScale": 0.15,
                "horizontalAlignment": "Justify",
            }
        },
    },
    
    "modules":
    {
        "image":
        {
            "positionX": 0,
            "positionY": 0,
            "width": 1080,
            "height": 1150
        },
        
        "name":
        {
            "positionX": 1200,
            "positionY": 15,
            "width": 2400,
            "height": 300,
            
            "style": "@title",
        },
        
        "name_shade":
        {
            "positionX": 1210,
            "positionY": 25,
            "width": 2400,
            "height": 300,
            
            "style": "@titleShade",
        },
        
        "subtitle":
        {
            "positionX": 1200,
            "positionY": 160,
            "width": 2400,
            "height": 140,
            
            "style": "@subtitle",
        },
        
        "subtitle_shade":
        {
            "positionX": 1210,
            "positionY": 175,
            "width": 2400,
            "height": 140,
            
            "style": "@subtitleShade",
        },
        
        "stats":
        {
            "positionX": 600,
            "positionY": 600,
            "width": 700,
            "height": 700,
            
            "stats":
            {
                "move": { "type": "integer", "x": 310, "y": 150 },
                "save": { "type": "dice", "x": 190, "y": 350 },
                "agility": { "type": "dice", "x": 390, "y": 350 }
            },
            
            "style": "@stats",
        },
        
        "dice_space":
        {
            "positionX": 1480,
            "positionY": 383,
            "width": 1930,
            "height": 300,
            
            "diceMaxWidth": 300,
            "defaultDiceSpace": [ { "count": 4, "image": "tokens/dice-gray.png" } ]
        },
        
        "weapons":
        {
            "positionX": 1340,
            "positionY": 760,
            "width": 2115,
            
            "stats":
            {
                "cost":     "dice",
                "range":    [ "combat", "missile", "area" ],
                "hit":      "dice",
                "damage":   "string"
            },
            
            "headerRow": [ "WEAPON ACTIONS", "Range", "Hit", "Damage" ],
            "bodyRowTemplate": [ "{name} ({cost}+)", "{range}", "{hit}+", "{damage}" ],
            "verticalColumns": [ 0, 1080, 1520, 1730, 2115 ],
            "headerRowInterval": 70,
            "rowIntervalByCount": [ null, null, 60, 40 ],
            "cellHeight": 110,
            
            "style": "@weapons",
        },
        
        "rules":
        {
            "positionX": 0,
            "positionY": 1330,
            "width": 3600,
            "height": 1250,
            
            "gradient":
            [
                { "position": 0, "color": "0x00ffffff" },
                { "position": 250, "color": "0x00ffffff" },
                { "position": 1200, "color": "0x50ffffff" },
                { "position": 2400, "color": "0x50ffffff" },
                { "position": 3400, "color": "0x00ffffff" },
                { "position": 3600, "color": "0x00ffffff" }
            ],
            
            "textLeft": 365,
            "textWidthNoDice": 3233,
            "textWidthWithDice": 2933,
            "defaultRulesSeparatorHeight": 100,
            "dicePosition": 3260,
            "diceImage": "tokens/dice-gray.png",
            
            "style": "@rules",
        },
    },
    
    "baseNameTemplate": "hero_templates/hero_card_base_{weaponsCount}_weapons.png",
    "outputDirectory": "heroes/",
    "rawDirectory": "heroes/"
}
