{
    "title": "artifact",
    "type": "object",
    
    "properties":
    {
        "name":                 { "type": "string" },
        "description":          { "type": "string" },
        "effect":               { "type": [ "string", "null" ] },
        "autoAdjustScale":      { "type": "boolean" },
        
        "weapons":
        {
            "type": "array",
            "items": { "$ref": "definitions/heroic_weapon.json" }
        },
        
        "abilities":
        {
            "type": "array",
            "items": { "$ref": "definitions/heroic_ability.json" }
        },
        
        "set": { "type": "string" },
        "type": { "type": "string", "value": "artifact" },
        "copies": { "$ref": "definitions/positive_integer.json" },
        "itemType": { "type": [ "string", "null" ] },
        "categories":
        {
            "oneOf":
            [
                { "type": "null" },
                {
                    "type": "array",
                    "items": [ { "type": "string" } ],
                    "minItems": 1,
                    "uniqueItems": true
                }
            ]
        },
        
        "descriptionFontSizeScale": { "type": "number" },
        "categoriesFontSizeScale":  { "type": "number" },
        "rulesFontSizeScale":       { "type": "number" },
        "separatorScale":           { "type": "number" }
    
    },
    "additionalProperties": false,
    "required": [ "name", "description", "effect", "type", "set" ]
}
