{
    "name": "2 Nights Later...",
    "image": "keystone/images/2-nights-later.png",
    "race": "terran",
    
    "minerals": 4,
    "gas": 0,
    
    "type": "aggressive unit",
    "effect": "20 neutral-aggressive infested civilians are spawned in random locations, and 5 more for each exhausted card in your deck.\n\nThey always attack the nearest unit or structure and do not chaise any enemies.\n\nRush, Transform",
    "set": "hammerdraw/kmc",
    "rarity": "common"
}
