{
    "effect": "Send 1 predator. Rush",
    "gas": 1,
    "image": "images/predator.png",
    "minerals": 1,
    "name": "Predator",
    "race": "terran",
    "rarity": "common",
    "set": "hammerdraw/terran-mech",
    "type": "aggressive unit"
}
