{
    "name": "Lava Crab",
    "image": "images/lava-crab.png",
    "race": "zerg",
    
    "minerals": 3,
    "gas": 1,
    
    "type": "tactical unit",
    "effect": "Send 1 heroic lava crab.\n\nIt ties to abduct itself towards the enemy psionic unit.\n\nIf it does, it eats it and mutates into a molten salamander.",
    "set": "hammerdraw/hs-references",
    "rarity": "uncommon"
}
