{
    "effect": "Send 2 ghosts.\n\nLaunch: Shuffle 5 Exhausted Gayser cards to your deck.",
    "gas": 1,
    "image": "images/rogue-ghosts.png",
    "minerals": 0,
    "name": "Rogue Ghosts",
    "race": "terran",
    "rarity": "uncommon",
    "set": "hammerdraw/kmc",
    "type": "tactical unit"
}
