{
    "name": "Primal Wurms",
    "image": "images/primal-wurm.png",
    "race": "zerg",
    
    "minerals": 6,
    "gas": 2,
    
    "type": "tactical unit - structure - primal",
    "effect": "Build 2 primal wurms in your defensive area. They use Deep Tunnel to retreat towards your team's Keystone.",
    "set": "lorcogoth",
    "rarity": "common"
}
