{
    "effect": "Send 1 heroic noble and 4 escorting ghost guards which are permanentally cloacked. Ghosts prioritize enemies attacking Mengsk and leave the battlefield if he is slain.\n\nEach turn Mengsk discards you a card and skips the draw step. Instead, he adds 1 random Dominion Special Forces card, and 1 random terran action or the ghost escort card.",
    "textFontSizeScale": 0.8,
    "gas": 3,
    "image": "images/emperor-arcturus-mengsk.png",
    "minerals": 6,
    "name": "Emperor Arcturus Mengsk",
    "titleFontSizeScale": 0.8,
    "race": "terran",
    "rarity": "unique",
    "set": "hammerdraw",
    "type": "tactical unit"
}
