{
    "name": "Tech Reactor",
    "image": "images/tech-reactor.png",
    "race": "terran",
    
    "minerals": 5,
    "gas": 3,
    
    "type": "action",
    "effect": "Attach a tech reactor to a barracks, factory, or starport (only those without add-ons). This add-on combine effects of both tech lab and reactor, allowing to produce 4 marauders, 2 siege tanks, or 2 banshees each round.",
    "set": "hammerdraw/terran-buildings-shenanigans",
    "rarity": "rare"
}
