{
    "name": "Hidden Cache (B)",
    "image": "images/hidden-cache.png",
    "race": "terran",
    
    "minerals": 6,
    "gas": 3,
    
    "type": "structure",
    "effect": "Build a supply depot.\n\nWhile in deck, increase your deck size by 5. While in hand, your structures cannot produce units.",
    "set": "hammerdraw",
    "rarity": "mythic"
}
