{
    "name": "Simulant Drone",
    "image": "images/simulant-drone.png",
    "race": "terran",
    
    "minerals": 3,
    "gas": 1,
    
    "type": "structure - simulant",
    "effect": "Build a copy of a random enemy zerg basic structure that costs 2 or more. If none, it builds a random Simulant Zerg structure that costs 2 to 4.\n\nLaunch: Reduce the cost of all Simulant cards in your hand and deck by 1 mineral.",
    "set": "hammerdraw/project-simulant",
    "rarity": "uncommon"
}
