{
    "name": "Annihilator",
    "image": "images/annihilator.png",
    "race": "protoss",
    
    "minerals": 3,
    "gas": 1,
    
    "type": "aggressive unit",
    "effect": "Send 1 Immortal.\n\nLaunch: It fires Shadow Cannon for 500 damage targetting the toughest enemy unit.",
    "set": "hammerdraw",
    "rarity": "common"
}
