{
    "name": "Emergency Wall-off",
    "image": "images/emergency-wall-off.png",
    "race": "terran",
    
    "minerals": 3,
    "gas": 0,
    
    "type": "action",
    "effect": "Lift-off all your production buildings (attachments left as is). They try to make a full wall near your side of the cliff, then complete the wall with the supply depots.\n\nAdd a Wall-out card to your hand.",
    "set": "hammerdraw/terran-buildings-shenanigans",
    "rarity": "uncommon"
}
