{
	"info": {
		"_postman_id": "40f6a689-5595-419d-b740-c7088ce6c710",
		"name": "VeloxDemoDeployPrice",
		"schema": "https://schema.getpostman.com/json/collection/v2.1.0/collection.json"
	},
	"item": [
		{
			"name": "get currency",
			"event": [
				{
					"listen": "test",
					"script": {
						"exec": [
							"pm.test(\"Status code is 200\", function () {",
							"    pm.response.to.have.status(200);",
							"});",
							"",
							"var data = JSON.parse(responseBody);",
							"var found = false;",
							"",
							"data.content.forEach((currency) => {",
							"  if (currency.isoCode === pm.variables.get(\"currencyIsoCode\")) {",
							"    pm.globals.set('currencyId', currency.id);",
							"    found = true;",
							"  }",
							"});",
							"",
							"pm.test(\"Check if currency is available\", function () {",
							"  pm.expect(found).to.equal(true);",
							"});"
						],
						"type": "text/javascript"
					}
				}
			],
			"protocolProfileBehavior": {
				"disableBodyPruning": true
			},
			"request": {
				"auth": {
					"type": "noauth"
				},
				"method": "GET",
				"header": [],
				"body": {
					"mode": "raw",
					"raw": "{\n  \"articleId\": \"{{articleId}}\",\n  \"unitPrice\": {{unitPrice}},\n  \"validFrom\": \"{{priceValidFrom}}\",\n  \"validTo\": \"{{priceValidTo}}\"\n}",
					"options": {
						"raw": {
							"language": "json"
						}
					}
				},
				"url": {
					"raw": "{{protocol}}://{{hostname}}:{{pricePort}}/{{priceContextpath}}/currencies",
					"protocol": "{{protocol}}",
					"host": [
						"{{hostname}}"
					],
					"port": "{{pricePort}}",
					"path": [
						"{{priceContextpath}}",
						"currencies"
					]
				}
			},
			"response": []
		},
		{
			"name": "create price",
			"event": [
				{
					"listen": "test",
					"script": {
						"exec": [
							"pm.test(\"Status code is 201\", function () {",
							"    pm.response.to.have.status(201);",
							"});",
							"",
							"var data = JSON.parse(responseBody);",
							"",
							"var id = data.id;",
							"",
							"postman.setEnvironmentVariable(\"priceId\", id);"
						],
						"type": "text/javascript"
					}
				}
			],
			"request": {
				"auth": {
					"type": "bearer",
					"bearer": [
						{
							"key": "token",
							"value": "{{token}}",
							"type": "string"
						}
					]
				},
				"method": "POST",
				"header": [],
				"body": {
					"mode": "raw",
					"raw": "{\n  \"articleId\": \"{{articleId}}\",\n  \"unitPrice\": {{unitPrice}},\n  \"validFrom\": \"{{priceValidFrom}}\",\n  \"validTo\": \"{{priceValidTo}}\",\n  \"currency\": {\n    \"id\": \"{{currencyId}}\"\n  }\n}",
					"options": {
						"raw": {
							"language": "json"
						}
					}
				},
				"url": {
					"raw": "{{protocol}}://{{hostname}}:{{pricePort}}/{{priceContextpath}}/prices",
					"protocol": "{{protocol}}",
					"host": [
						"{{hostname}}"
					],
					"port": "{{pricePort}}",
					"path": [
						"{{priceContextpath}}",
						"prices"
					]
				}
			},
			"response": []
		}
	]
}