{
	"info": {
		"_postman_id": "c71927a9-2085-4893-945b-2dc265224809",
		"name": "VeloxDemoDeployRecommendation",
		"schema": "https://schema.getpostman.com/json/collection/v2.1.0/collection.json"
	},
	"item": [
		{
			"name": "generate Recommendation",
			"event": [
				{
					"listen": "test",
					"script": {
						"exec": [
							"pm.test(\"Status code is 200\", function () {",
							"    pm.response.to.have.status(200);",
							"});",
							"",
							""
						],
						"type": "text/javascript"
					}
				}
			],
			"request": {
				"method": "POST",
				"header": [],
				"url": {
					"raw": "{{protocol}}://{{hostname}}:{{recommendationPort}}/{{recommendationContextpath}}/recommendations/analyze",
					"protocol": "{{protocol}}",
					"host": [
						"{{hostname}}"
					],
					"port": "{{recommendationPort}}",
					"path": [
						"{{recommendationContextpath}}",
						"recommendations",
						"analyze"
					]
				}
			},
			"response": []
		}
	]
}