^C:\USERS\HAMED.GARA\DESKTOP\MY-PROJECT\CMAKELISTS.TXT
setlocal
"C:\Program Files\CMake\bin\cmake.exe" -SC:/Users/hamed.gara/Desktop/my-project -BC:/Users/hamed.gara/Desktop/my-project/build --check-stamp-file C:/Users/hamed.gara/Desktop/my-project/build/CMakeFiles/generate.stamp
if %errorlevel% neq 0 goto :cmEnd
:cmEnd
endlocal & call :cmErrorLevel %errorlevel% & goto :cmDone
:cmErrorLevel
exit /b %1
:cmDone
if %errorlevel% neq 0 goto :VCEnd
