^C:\USERS\HAMED.GARA\DESKTOP\MY-PROJECT\BUILD\HELLO_TEST.DIR\DEBUG\HELLO_TEST.OBJ
C:\USERS\HAMED.GARA\DESKTOP\MY-PROJECT\BUILD\DEBUG\HELLO_TEST.EXE
C:\USERS\HAMED.GARA\DESKTOP\MY-PROJECT\BUILD\HELLO_TEST.DIR\DEBUG\HELLO_TEST.ILK
C:\USERS\HAMED.GARA\DESKTOP\MY-PROJECT\BUILD\DEBUG\HELLO_TEST.PDB
