^C:\USERS\HAMED.GARA\DESKTOP\MY-PROJECT\BUILD\_DEPS\GOOGLETEST-SRC\GOOGLETEST\SRC\GTEST-ALL.CC
/c /I"C:\USERS\HAMED.GARA\DESKTOP\MY-PROJECT\BUILD\_DEPS\GOOGLETEST-SRC\GOOGLEMOCK\INCLUDE" /I"C:\USERS\HAMED.GARA\DESKTOP\MY-PROJECT\BUILD\_DEPS\GOOGLETEST-SRC\GOOGLEMOCK" /I"C:\USERS\HAMED.GARA\DESKTOP\MY-PROJECT\BUILD\_DEPS\GOOGLETEST-SRC\GOOGLETEST\INCLUDE" /I"C:\USERS\HAMED.GARA\DESKTOP\MY-PROJECT\BUILD\_DEPS\GOOGLETEST-SRC\GOOGLETEST" /Zi /nologo /W4 /WX /diagnostics:column /Od /Ob0 /D _UNICODE /D UNICODE /D WIN32 /D _WINDOWS /D _UNICODE /D UNICODE /D _WIN32 /D STRICT /D WIN32_LEAN_AND_MEAN /D GTEST_HAS_PTHREAD=0 /D _HAS_EXCEPTIONS=1 /D "CMAKE_INTDIR=\"Debug\"" /Gm- /EHsc /RTC1 /MDd /GS /fp:precise /Zc:wchar_t /Zc:forScope /Zc:inline /GR /std:c++14 /Fo"GMOCK_MAIN.DIR\DEBUG\\" /Fd"C:\USERS\HAMED.GARA\DESKTOP\MY-PROJECT\BUILD\LIB\DEBUG\GMOCK_MAINPDB_DEBUG_POSTFIX-NOTFOUND.PDB" /external:W4 /Gd /TP /wd4251 /wd4275 /wd4702  -J -utf-8 C:\USERS\HAMED.GARA\DESKTOP\MY-PROJECT\BUILD\_DEPS\GOOGLETEST-SRC\GOOGLETEST\SRC\GTEST-ALL.CC
^C:\USERS\HAMED.GARA\DESKTOP\MY-PROJECT\BUILD\_DEPS\GOOGLETEST-SRC\GOOGLEMOCK\SRC\GMOCK-ALL.CC
/c /I"C:\USERS\HAMED.GARA\DESKTOP\MY-PROJECT\BUILD\_DEPS\GOOGLETEST-SRC\GOOGLEMOCK\INCLUDE" /I"C:\USERS\HAMED.GARA\DESKTOP\MY-PROJECT\BUILD\_DEPS\GOOGLETEST-SRC\GOOGLEMOCK" /I"C:\USERS\HAMED.GARA\DESKTOP\MY-PROJECT\BUILD\_DEPS\GOOGLETEST-SRC\GOOGLETEST\INCLUDE" /I"C:\USERS\HAMED.GARA\DESKTOP\MY-PROJECT\BUILD\_DEPS\GOOGLETEST-SRC\GOOGLETEST" /Zi /nologo /W4 /WX /diagnostics:column /Od /Ob0 /D _UNICODE /D UNICODE /D WIN32 /D _WINDOWS /D _UNICODE /D UNICODE /D _WIN32 /D STRICT /D WIN32_LEAN_AND_MEAN /D GTEST_HAS_PTHREAD=0 /D _HAS_EXCEPTIONS=1 /D "CMAKE_INTDIR=\"Debug\"" /Gm- /EHsc /RTC1 /MDd /GS /fp:precise /Zc:wchar_t /Zc:forScope /Zc:inline /GR /std:c++14 /Fo"GMOCK_MAIN.DIR\DEBUG\\" /Fd"C:\USERS\HAMED.GARA\DESKTOP\MY-PROJECT\BUILD\LIB\DEBUG\GMOCK_MAINPDB_DEBUG_POSTFIX-NOTFOUND.PDB" /external:W4 /Gd /TP /wd4251 /wd4275 /wd4702  -J -utf-8 C:\USERS\HAMED.GARA\DESKTOP\MY-PROJECT\BUILD\_DEPS\GOOGLETEST-SRC\GOOGLEMOCK\SRC\GMOCK-ALL.CC
^C:\USERS\HAMED.GARA\DESKTOP\MY-PROJECT\BUILD\_DEPS\GOOGLETEST-SRC\GOOGLEMOCK\SRC\GMOCK_MAIN.CC
/c /I"C:\USERS\HAMED.GARA\DESKTOP\MY-PROJECT\BUILD\_DEPS\GOOGLETEST-SRC\GOOGLEMOCK\INCLUDE" /I"C:\USERS\HAMED.GARA\DESKTOP\MY-PROJECT\BUILD\_DEPS\GOOGLETEST-SRC\GOOGLEMOCK" /I"C:\USERS\HAMED.GARA\DESKTOP\MY-PROJECT\BUILD\_DEPS\GOOGLETEST-SRC\GOOGLETEST\INCLUDE" /I"C:\USERS\HAMED.GARA\DESKTOP\MY-PROJECT\BUILD\_DEPS\GOOGLETEST-SRC\GOOGLETEST" /Zi /nologo /W4 /WX /diagnostics:column /Od /Ob0 /D _UNICODE /D UNICODE /D WIN32 /D _WINDOWS /D _UNICODE /D UNICODE /D _WIN32 /D STRICT /D WIN32_LEAN_AND_MEAN /D GTEST_HAS_PTHREAD=0 /D _HAS_EXCEPTIONS=1 /D "CMAKE_INTDIR=\"Debug\"" /Gm- /EHsc /RTC1 /MDd /GS /fp:precise /Zc:wchar_t /Zc:forScope /Zc:inline /GR /std:c++14 /Fo"GMOCK_MAIN.DIR\DEBUG\\" /Fd"C:\USERS\HAMED.GARA\DESKTOP\MY-PROJECT\BUILD\LIB\DEBUG\GMOCK_MAINPDB_DEBUG_POSTFIX-NOTFOUND.PDB" /external:W4 /Gd /TP /wd4251 /wd4275 /wd4702  -J -utf-8 C:\USERS\HAMED.GARA\DESKTOP\MY-PROJECT\BUILD\_DEPS\GOOGLETEST-SRC\GOOGLEMOCK\SRC\GMOCK_MAIN.CC
