^C:\USERS\HAMED.GARA\DESKTOP\MY-PROJECT\BUILD\_DEPS\GOOGLETEST-SRC\GOOGLETEST\SRC\GTEST_MAIN.CC
C:\USERS\HAMED.GARA\DESKTOP\MY-PROJECT\BUILD\LIB\DEBUG\GTEST_MAINPDB_DEBUG_POSTFIX-NOTFOUND.PDB
C:\USERS\HAMED.GARA\DESKTOP\MY-PROJECT\BUILD\_DEPS\GOOGLETEST-BUILD\GOOGLETEST\GTEST_MAIN.DIR\DEBUG\GTEST_MAIN.OBJ
