^C:\USERS\HAMED.GARA\DESKTOP\MY-PROJECT\BUILD\_DEPS\GOOGLETEST-SUBBUILD\CMAKEFILES\FE287CAA4BABD8E3B3D26C18574B44F5\GOOGLETEST-POPULATE-MKDIR.RULE
C:\USERS\HAMED.GARA\DESKTOP\MY-PROJECT\BUILD\_DEPS\GOOGLETEST-SUBBUILD\GOOGLETEST-POPULATE-PREFIX\SRC\GOOGLETEST-POPULATE-STAMP\DEBUG\GOOGLETEST-POPULATE-MKDIR
^C:\USERS\HAMED.GARA\DESKTOP\MY-PROJECT\BUILD\_DEPS\GOOGLETEST-SUBBUILD\CMAKEFILES\FE287CAA4BABD8E3B3D26C18574B44F5\GOOGLETEST-POPULATE-DOWNLOAD.RULE
C:\USERS\HAMED.GARA\DESKTOP\MY-PROJECT\BUILD\_DEPS\GOOGLETEST-SUBBUILD\GOOGLETEST-POPULATE-PREFIX\SRC\GOOGLETEST-POPULATE-STAMP\DEBUG\GOOGLETEST-POPULATE-DOWNLOAD
^C:\USERS\HAMED.GARA\DESKTOP\MY-PROJECT\BUILD\_DEPS\GOOGLETEST-SUBBUILD\CMAKEFILES\FE287CAA4BABD8E3B3D26C18574B44F5\GOOGLETEST-POPULATE-UPDATE.RULE
C:\USERS\HAMED.GARA\DESKTOP\MY-PROJECT\BUILD\_DEPS\GOOGLETEST-SUBBUILD\GOOGLETEST-POPULATE-PREFIX\SRC\GOOGLETEST-POPULATE-STAMP\DEBUG\GOOGLETEST-POPULATE-UPDATE
^C:\USERS\HAMED.GARA\DESKTOP\MY-PROJECT\BUILD\_DEPS\GOOGLETEST-SUBBUILD\CMAKEFILES\FE287CAA4BABD8E3B3D26C18574B44F5\GOOGLETEST-POPULATE-PATCH.RULE
C:\USERS\HAMED.GARA\DESKTOP\MY-PROJECT\BUILD\_DEPS\GOOGLETEST-SUBBUILD\GOOGLETEST-POPULATE-PREFIX\SRC\GOOGLETEST-POPULATE-STAMP\DEBUG\GOOGLETEST-POPULATE-PATCH
^C:\USERS\HAMED.GARA\DESKTOP\MY-PROJECT\BUILD\_DEPS\GOOGLETEST-SUBBUILD\CMAKEFILES\FE287CAA4BABD8E3B3D26C18574B44F5\GOOGLETEST-POPULATE-CONFIGURE.RULE
C:\USERS\HAMED.GARA\DESKTOP\MY-PROJECT\BUILD\_DEPS\GOOGLETEST-SUBBUILD\GOOGLETEST-POPULATE-PREFIX\SRC\GOOGLETEST-POPULATE-STAMP\DEBUG\GOOGLETEST-POPULATE-CONFIGURE
^C:\USERS\HAMED.GARA\DESKTOP\MY-PROJECT\BUILD\_DEPS\GOOGLETEST-SUBBUILD\CMAKEFILES\FE287CAA4BABD8E3B3D26C18574B44F5\GOOGLETEST-POPULATE-BUILD.RULE
C:\USERS\HAMED.GARA\DESKTOP\MY-PROJECT\BUILD\_DEPS\GOOGLETEST-SUBBUILD\GOOGLETEST-POPULATE-PREFIX\SRC\GOOGLETEST-POPULATE-STAMP\DEBUG\GOOGLETEST-POPULATE-BUILD
^C:\USERS\HAMED.GARA\DESKTOP\MY-PROJECT\BUILD\_DEPS\GOOGLETEST-SUBBUILD\CMAKEFILES\FE287CAA4BABD8E3B3D26C18574B44F5\GOOGLETEST-POPULATE-INSTALL.RULE
C:\USERS\HAMED.GARA\DESKTOP\MY-PROJECT\BUILD\_DEPS\GOOGLETEST-SUBBUILD\GOOGLETEST-POPULATE-PREFIX\SRC\GOOGLETEST-POPULATE-STAMP\DEBUG\GOOGLETEST-POPULATE-INSTALL
^C:\USERS\HAMED.GARA\DESKTOP\MY-PROJECT\BUILD\_DEPS\GOOGLETEST-SUBBUILD\CMAKEFILES\FE287CAA4BABD8E3B3D26C18574B44F5\GOOGLETEST-POPULATE-TEST.RULE
C:\USERS\HAMED.GARA\DESKTOP\MY-PROJECT\BUILD\_DEPS\GOOGLETEST-SUBBUILD\GOOGLETEST-POPULATE-PREFIX\SRC\GOOGLETEST-POPULATE-STAMP\DEBUG\GOOGLETEST-POPULATE-TEST
^C:\USERS\HAMED.GARA\DESKTOP\MY-PROJECT\BUILD\_DEPS\GOOGLETEST-SUBBUILD\CMAKEFILES\D436DAC564B16DF26DC86B43C98D63F7\GOOGLETEST-POPULATE-COMPLETE.RULE
C:\USERS\HAMED.GARA\DESKTOP\MY-PROJECT\BUILD\_DEPS\GOOGLETEST-SUBBUILD\CMAKEFILES\DEBUG\GOOGLETEST-POPULATE-COMPLETE
^C:\USERS\HAMED.GARA\DESKTOP\MY-PROJECT\BUILD\_DEPS\GOOGLETEST-SUBBUILD\CMAKEFILES\AB67E4C497519F34FEC84CB671210A12\GOOGLETEST-POPULATE.RULE
C:\USERS\HAMED.GARA\DESKTOP\MY-PROJECT\BUILD\_DEPS\GOOGLETEST-SUBBUILD\CMAKEFILES\GOOGLETEST-POPULATE
^C:\USERS\HAMED.GARA\DESKTOP\MY-PROJECT\BUILD\_DEPS\GOOGLETEST-SUBBUILD\CMAKELISTS.TXT
C:\USERS\HAMED.GARA\DESKTOP\MY-PROJECT\BUILD\_DEPS\GOOGLETEST-SUBBUILD\CMAKEFILES\GENERATE.STAMP
