^C:\USERS\HAMED.GARA\DESKTOP\EXAMPLE\BUILD\CMAKEFILES\3.25.0-RC4\COMPILERIDCXX\CMAKECXXCOMPILERID.CPP
C:\WINDOWS\GLOBALIZATION\SORTING\SORTDEFAULT.NLS
C:\PROGRAM FILES\MICROSOFT VISUAL STUDIO\2022\COMMUNITY\VC\TOOLS\MSVC\14.34.31933\BIN\HOSTX64\X64\1036\CLUI.DLL
C:\WINDOWS\SYSTEM32\TZRES.DLL
