^C:\USERS\HAMED.GARA\DESKTOP\EXAMPLE\BUILD\GOOGLETEST\GOOGLETEST\GTEST.DIR\DEBUG\GTEST-ALL.OBJ
C:\USERS\HAMED.GARA\DESKTOP\EXAMPLE\BUILD\GOOGLETEST\GOOGLETEST\GTEST.DIR\DEBUG\GTEST-ALL.OBJ
C:\WINDOWS\SYSTEM32\TZRES.DLL
