^C:\USERS\HAMED.GARA\DESKTOP\EXAMPLE\BUILD\GOOGLETEST\GOOGLEMOCK\GMOCK.DIR\DEBUG\GMOCK-ALL.OBJ|C:\USERS\HAMED.GARA\DESKTOP\EXAMPLE\BUILD\GOOGLETEST\GOOGLEMOCK\GMOCK.DIR\DEBUG\GTEST-ALL.OBJ
C:\USERS\HAMED.GARA\DESKTOP\EXAMPLE\BUILD\GOOGLETEST\GOOGLEMOCK\GMOCK.DIR\DEBUG\GTEST-ALL.OBJ
C:\WINDOWS\SYSTEM32\TZRES.DLL
C:\USERS\HAMED.GARA\DESKTOP\EXAMPLE\BUILD\GOOGLETEST\GOOGLEMOCK\GMOCK.DIR\DEBUG\GMOCK-ALL.OBJ
C:\WINDOWS\GLOBALIZATION\SORTING\SORTDEFAULT.NLS
