^C:\USERS\HAMED.GARA\DESKTOP\EXAMPLE\BUILD\CMAKEFILES\726848C3DE4372129F2C3B30765BE061\GENERATE.STAMP.RULE
C:\PROGRAM FILES\CMAKE\SHARE\CMAKE-3.25\MODULES\BASICCONFIGVERSION-ANYNEWERVERSION.CMAKE.IN
C:\PROGRAM FILES\CMAKE\SHARE\CMAKE-3.25\MODULES\CMAKECINFORMATION.CMAKE
C:\PROGRAM FILES\CMAKE\SHARE\CMAKE-3.25\MODULES\CMAKECXXINFORMATION.CMAKE
C:\PROGRAM FILES\CMAKE\SHARE\CMAKE-3.25\MODULES\CMAKECOMMONLANGUAGEINCLUDE.CMAKE
C:\PROGRAM FILES\CMAKE\SHARE\CMAKE-3.25\MODULES\CMAKEDEPENDENTOPTION.CMAKE
C:\PROGRAM FILES\CMAKE\SHARE\CMAKE-3.25\MODULES\CMAKEGENERICSYSTEM.CMAKE
C:\PROGRAM FILES\CMAKE\SHARE\CMAKE-3.25\MODULES\CMAKEINITIALIZECONFIGS.CMAKE
C:\PROGRAM FILES\CMAKE\SHARE\CMAKE-3.25\MODULES\CMAKELANGUAGEINFORMATION.CMAKE
C:\PROGRAM FILES\CMAKE\SHARE\CMAKE-3.25\MODULES\CMAKEPACKAGECONFIGHELPERS.CMAKE
C:\PROGRAM FILES\CMAKE\SHARE\CMAKE-3.25\MODULES\CMAKERCINFORMATION.CMAKE
C:\PROGRAM FILES\CMAKE\SHARE\CMAKE-3.25\MODULES\CMAKESYSTEMSPECIFICINFORMATION.CMAKE
C:\PROGRAM FILES\CMAKE\SHARE\CMAKE-3.25\MODULES\CMAKESYSTEMSPECIFICINITIALIZE.CMAKE
C:\PROGRAM FILES\CMAKE\SHARE\CMAKE-3.25\MODULES\CHECKCSOURCECOMPILES.CMAKE
C:\PROGRAM FILES\CMAKE\SHARE\CMAKE-3.25\MODULES\CHECKINCLUDEFILE.CMAKE
C:\PROGRAM FILES\CMAKE\SHARE\CMAKE-3.25\MODULES\CHECKLIBRARYEXISTS.CMAKE
C:\PROGRAM FILES\CMAKE\SHARE\CMAKE-3.25\MODULES\COMPILER\CMAKECOMMONCOMPILERMACROS.CMAKE
C:\PROGRAM FILES\CMAKE\SHARE\CMAKE-3.25\MODULES\COMPILER\MSVC-C.CMAKE
C:\PROGRAM FILES\CMAKE\SHARE\CMAKE-3.25\MODULES\COMPILER\MSVC-CXX.CMAKE
C:\PROGRAM FILES\CMAKE\SHARE\CMAKE-3.25\MODULES\COMPILER\MSVC.CMAKE
C:\PROGRAM FILES\CMAKE\SHARE\CMAKE-3.25\MODULES\FINDPACKAGEHANDLESTANDARDARGS.CMAKE
C:\PROGRAM FILES\CMAKE\SHARE\CMAKE-3.25\MODULES\FINDPACKAGEMESSAGE.CMAKE
C:\PROGRAM FILES\CMAKE\SHARE\CMAKE-3.25\MODULES\FINDPYTHON.CMAKE
C:\PROGRAM FILES\CMAKE\SHARE\CMAKE-3.25\MODULES\FINDPYTHON\SUPPORT.CMAKE
C:\PROGRAM FILES\CMAKE\SHARE\CMAKE-3.25\MODULES\FINDTHREADS.CMAKE
C:\PROGRAM FILES\CMAKE\SHARE\CMAKE-3.25\MODULES\GNUINSTALLDIRS.CMAKE
C:\PROGRAM FILES\CMAKE\SHARE\CMAKE-3.25\MODULES\INTERNAL\CHECKSOURCECOMPILES.CMAKE
C:\PROGRAM FILES\CMAKE\SHARE\CMAKE-3.25\MODULES\PLATFORM\WINDOWS-MSVC-C.CMAKE
C:\PROGRAM FILES\CMAKE\SHARE\CMAKE-3.25\MODULES\PLATFORM\WINDOWS-MSVC-CXX.CMAKE
C:\PROGRAM FILES\CMAKE\SHARE\CMAKE-3.25\MODULES\PLATFORM\WINDOWS-MSVC.CMAKE
C:\PROGRAM FILES\CMAKE\SHARE\CMAKE-3.25\MODULES\PLATFORM\WINDOWS.CMAKE
C:\PROGRAM FILES\CMAKE\SHARE\CMAKE-3.25\MODULES\PLATFORM\WINDOWSPATHS.CMAKE
C:\PROGRAM FILES\CMAKE\SHARE\CMAKE-3.25\MODULES\WRITEBASICCONFIGVERSIONFILE.CMAKE
C:\USERS\HAMED.GARA\DESKTOP\EXAMPLE\CMAKELISTS.TXT
C:\USERS\HAMED.GARA\DESKTOP\EXAMPLE\BUILD\CMAKEFILES\3.25.0-RC4\CMAKECCOMPILER.CMAKE
C:\USERS\HAMED.GARA\DESKTOP\EXAMPLE\BUILD\CMAKEFILES\3.25.0-RC4\CMAKECXXCOMPILER.CMAKE
C:\USERS\HAMED.GARA\DESKTOP\EXAMPLE\BUILD\CMAKEFILES\3.25.0-RC4\CMAKERCCOMPILER.CMAKE
C:\USERS\HAMED.GARA\DESKTOP\EXAMPLE\BUILD\CMAKEFILES\3.25.0-RC4\CMAKESYSTEM.CMAKE
C:\USERS\HAMED.GARA\DESKTOP\EXAMPLE\GOOGLETEST\CMAKELISTS.TXT
C:\USERS\HAMED.GARA\DESKTOP\EXAMPLE\GOOGLETEST\GOOGLEMOCK\CMAKELISTS.TXT
C:\USERS\HAMED.GARA\DESKTOP\EXAMPLE\GOOGLETEST\GOOGLEMOCK\CMAKE\GMOCK.PC.IN
C:\USERS\HAMED.GARA\DESKTOP\EXAMPLE\GOOGLETEST\GOOGLEMOCK\CMAKE\GMOCK_MAIN.PC.IN
C:\USERS\HAMED.GARA\DESKTOP\EXAMPLE\GOOGLETEST\GOOGLETEST\CMAKELISTS.TXT
C:\USERS\HAMED.GARA\DESKTOP\EXAMPLE\GOOGLETEST\GOOGLETEST\CMAKE\CONFIG.CMAKE.IN
C:\USERS\HAMED.GARA\DESKTOP\EXAMPLE\GOOGLETEST\GOOGLETEST\CMAKE\GTEST.PC.IN
C:\USERS\HAMED.GARA\DESKTOP\EXAMPLE\GOOGLETEST\GOOGLETEST\CMAKE\GTEST_MAIN.PC.IN
C:\USERS\HAMED.GARA\DESKTOP\EXAMPLE\GOOGLETEST\GOOGLETEST\CMAKE\INTERNAL_UTILS.CMAKE
C:\USERS\HAMED.GARA\DESKTOP\EXAMPLE\TEST\CMAKELISTS.TXT
