<?xml version="1.0" encoding="utf-8"?>
<!-- Generator: Adobe Illustrator 27.1.1, SVG Export Plug-In . SVG Version: 6.00 Build 0)  -->
<svg version="1.1" id="Layer_1" xmlns="http://www.w3.org/2000/svg" xmlns:xlink="http://www.w3.org/1999/xlink" x="0px" y="0px"
	 viewBox="0 0 2400 950" style="enable-background:new 0 0 2400 950;" xml:space="preserve">
<style type="text/css">
	.st0{fill:#BF0035;}
	.st1{fill:#FFCC00;}
</style>
<g>
	<g>
		<g>
			<path class="st0" d="M2379.7,599.4c-17-22.7-43.8-36.3-71.7-36.3c-13.9,0-27.4,3.2-40.3,9.6c-21.7,10.7-45.3,20.4-70.3,29.2V206
				h83.8c31.6,0,57.3-25.7,57.3-57.3V63c0-31.6-25.7-57.3-57.3-57.3h-378.5c-14.2,0-27.1,5.2-37.1,13.7
				c-10.1-8.6-23.2-13.7-37.1-13.7h-94.8c-23.4,0-44.5,14.3-53.2,36l-117.6,294.1L1445.3,41.7c-8.7-21.8-29.8-36-53.2-36h-94.8
				c-23.4,0-44.5,14.3-53.2,36l-60.8,152.2V63c0-31.6-25.7-57.3-57.3-57.3h-96.2c-31.6,0-57.3,25.7-57.3,57.3v133.7h-98.9V63
				c0-31.6-25.7-57.3-57.3-57.3h-96.2c-31.6,0-57.3,25.7-57.3,57.3v142.4c-220.5-6.5-532.3-72-548.5-75.4L74,119.4
				c-4.9-1.3-9.8-1.9-14.6-1.9c-22,0-42.6,12.7-52.1,33.5C-4.3,176.3,4,206.3,27,222l35.3,24.2c21.3,14.6,43,28.1,64.9,40.6
				c-8.3,4.5-15.6,11.1-21,19.5c-14.2,22.1-11.5,51,6.5,70.2l20.2,21.5c40.8,43.4,98.3,81.1,171.5,112.6
				c-1.7,16.3,3.6,32.9,15.5,45.4l20.1,21.1c71.8,75.4,171.1,130,295.2,162.5c74.5,19.5,156.7,30.9,245,33.8
				c-25.2,31.5-40.4,57.3-43.6,62.9l-12.7,22.2c-13.1,22.8-9,51.6,9.9,69.8c11,10.6,25.3,16,39.8,16c10.5,0,21-2.9,30.4-8.7
				l21.7-13.6c36.3-22.7,75.7-40,223.3-40c111.1,0,275,9.8,531.5,31.7c43.2,3.7,85.6,5.6,125.9,5.6c0,0,0,0,0,0
				c172.5,0,411-35.5,567.3-204.8C2403.6,682,2406.1,634.7,2379.7,599.4z"/>
			<g>
				<path class="st1" d="M816.3,339.7h213.5V554c54.1-1.3,145.6-12.4,175.2-23.9l33.3-85.2h180.3h27.5l12.6,32.2l27.5,70.4l7.7-3.6
					c20.5-9.3,39.7-17.6,57.5-25c6.8-2.8,13.4-5.5,19.9-8.1c35.5-14.1,65.3-24.2,90-31.4l13.5-34.5h207.9l7.8,20.6
					c44.5,5.8,86.7,17.5,112.1,39.9L1828.6,63h-94.8l-170.8,427.1L1392.1,63h-94.8l-171.3,428.6V63h-96.2v191H816.3V63h-96.2v485.7
					c30.6,3,62.8,5.2,96.2,6.3V339.7z M1778.7,176.8l71.6,185.4h-143.3L1778.7,176.8z M1342.2,176.8l71.6,185.4h-143.3L1342.2,176.8
					z"/>
				<path class="st1" d="M2043.9,610.6v58.8c-1.9,1.9,70.7-9.2,96.2-20.4V148.7h141.1V63h-378.5v85.7h141.1V610.6z"/>
				<path class="st1" d="M2333.8,633.8c-8.1-10.8-23.8-18-40.7-9.7c-182.2,90-451.7,104.5-536.3,52.8c-15-9.2-22.7-19.7-22.9-31.4
					c-0.2-11.3,3.1-20.2,10.1-27.1c22.9-22.6,82.1-21.1,134.3-19.7c60.2,1.6,112.1,3,119.9-28.1c3.5-14,0.6-26.7-8.6-37.8
					c-33.6-40.2-147-47.9-242-41.7c-109.8,7.2-321.8,115.8-404.1,160c31.5-37.4,81.3-105.6,86.1-168.6l0.9-11.4l-10.2,5.2
					C920.8,731.5,393.7,529.2,388.4,527.1l-27.1-10.7l20.1,21.1c184.7,193.8,530.7,185.1,653.2,175.1
					C947.4,759.6,889,859.9,886.2,864.8L873.4,887l21.7-13.6c84.4-52.7,179.4-69,790.1-16.8c367.1,31.4,554-81.1,646.3-181
					C2344.3,661.7,2341.9,644.6,2333.8,633.8z"/>
				<path class="st1" d="M688.1,434.4c-228,15-503.2-86.9-505.8-87.7l-27.9-9.4l20.2,21.5C298.4,490.5,580.4,533,688.1,544.8V434.4z
					"/>
				<path class="st1" d="M688.1,263.2c-232.6-1.8-584.3-76.8-587.4-77.6l-41.3-10.9l35.3,24.2c211.7,145.1,468.6,180.4,593.4,187
					V263.2z"/>
			</g>
		</g>
	</g>
</g>
</svg>
