https://eventlytemplate.webflow.io/401
https://eventlytemplate.webflow.io/404
https://eventlytemplate.webflow.io/post/5-great-marketing-trends-to-follow-in-2020
https://eventlytemplate.webflow.io/product/deluxe-ticket
https://eventlytemplate.webflow.io/speaker/john-carter
https://uploads-ssl.webflow.com/5f52d0a216ec497e4af64a96/5f52d0a216ec49559af64bcd_Consultant%20Template%20-%20Featured%20Image.png
https://uploads-ssl.webflow.com/63cc2f4cd802df3c3378884a/6463372898f456345c2993f2_IritKatriel.1.jpg
https://uploads-ssl.webflow.com/63cc2f4cd802df3c3378884a/6465f6805b639992063c3c5b_IritKatriel.1.jpg
https://uploads-ssl.webflow.com/63cc2f4cd802df3c3378884a/6465f6805b639992063c3c5b_IritKatriel.1-p-500.jpg
https://uploads-ssl.webflow.com/63cc2f4cd802df3c3378884a/6465f6805b639992063c3c5b_IritKatriel.1-p-800.jpg
https://uploads-ssl.webflow.com/63cc2f4cd802df3c3378884a/6465f6805b639992063c3c5b_IritKatriel.1-p-1080.jpg
https://uploads-ssl.webflow.com/63cc2f4cd802df3c3378884a/6465f6805b639992063c3c5b_IritKatriel.1-p-1600.jpg
https://uploads-ssl.webflow.com/63cc2f4cd802df3c3378884a/6465f6805b639992063c3c5b_IritKatriel.1-p-2000.jpg
https://uploads-ssl.webflow.com/63cc2f4cd802df3c3378884a/6465f6805b639992063c3c5b_IritKatriel.1.jpg
https://uploads-ssl.webflow.com/63cc2f4cd802df3c3378884a/6465f7034101441897c6f4c3_AMH.3.jpg
https://uploads-ssl.webflow.com/63cc2f4cd802df3c3378884a/6465f7034101441897c6f4c3_AMH.3-p-500.jpg
https://uploads-ssl.webflow.com/63cc2f4cd802df3c3378884a/6465f7034101441897c6f4c3_AMH.3-p-800.jpg
https://uploads-ssl.webflow.com/63cc2f4cd802df3c3378884a/6465f7034101441897c6f4c3_AMH.3-p-1080.jpg
https://uploads-ssl.webflow.com/63cc2f4cd802df3c3378884a/6465f7034101441897c6f4c3_AMH.3.jpg
https://uploads-ssl.webflow.com/63cc2f4cd802df3c3378884a/6465f75684d7c47cf062f517_eyal-trabelsi.png
https://uploads-ssl.webflow.com/63cc2f4cd802df3c3378884a/6465f75684d7c47cf062f51c_eyal-trabelsi.png
https://uploads-ssl.webflow.com/63cc2f4cd802df3c3378884a/6465f756e3306ff8cfce8cd1_avatar_QX6zHLJ.png
https://uploads-ssl.webflow.com/63cc2f4cd802df3c3378884a/6465f7571a3aa12850862e23_haki-benita.png
https://uploads-ssl.webflow.com/63cc2f4cd802df3c3378884a/6465f7577849c0e8d24fc39f_tom-ron.jpeg
https://uploads-ssl.webflow.com/63cc2f4cd802df3c3378884a/6465f7577849c0e8d24fc3a2_tom-ron.jpeg
https://uploads-ssl.webflow.com/63cc2f4cd802df3c3378884a/6465f7577e35b3105ad2c131_me_FeZ3wEK.png
https://uploads-ssl.webflow.com/63cc2f4cd802df3c3378884a/6465f7578f2f5bb51563c915_%25D7%25A8%25D7%259F-%25D7%2591%25D7%25A8-%25D7%2596%25D7%2599%25D7%25A7-%25D7%25AA%25D7%259E%25D7%2595%25D7%25A0%25D7%2594-%25D7%25A8%25D7%25A9%25D7%259E%25D7%2599%25D7%25AA-2023-%25D7%2592%25D7%2595%25D7%2593%25D7%259C-%25D7%25A7%25D7%2598%25D7%259F-%25D7%25A8%25D7%2599%25D7%2591%25D7%2595%25D7%25A2-300x293.jpeg
https://uploads-ssl.webflow.com/63cc2f4cd802df3c3378884a/6465f75d143b21af26b53327_Boris.Gorelik.jpeg
https://uploads-ssl.webflow.com/63cc2f4cd802df3c3378884a/6465f75d484f58b13a6a567e_yifat-makias.jpeg
https://uploads-ssl.webflow.com/63cc2f4cd802df3c3378884a/6465f75d84d7c47cf062fcd1_DALLE_hoodie.png
https://uploads-ssl.webflow.com/63cc2f4cd802df3c3378884a/6465f75d9bb93a528847dc28_josh-grossman.jpeg
https://uploads-ssl.webflow.com/63cc2f4cd802df3c3378884a/6465f75e4a540e853cce9c70_Screenshot_2023-03-23_202516.png
https://uploads-ssl.webflow.com/63cc2f4cd802df3c3378884a/6465f75e64f575f5dcadba51_me3.jpeg
https://uploads-ssl.webflow.com/63cc2f4cd802df3c3378884a/6465f75e64f575f5dcadba54_me3.jpeg
https://uploads-ssl.webflow.com/63cc2f4cd802df3c3378884a/6465f761348bdedaba377de6_Shai.Rubin.jpeg
https://uploads-ssl.webflow.com/63cc2f4cd802df3c3378884a/6465f7613e20c17600753294_sharon-rones.jpeg
https://uploads-ssl.webflow.com/63cc2f4cd802df3c3378884a/6465f7614311273dda4807a4_PHOTO-2022-10-02-12-36-33_aPmC8jt.jpeg
https://uploads-ssl.webflow.com/63cc2f4cd802df3c3378884a/6465f7614311273dda4807a7_PHOTO-2022-10-02-12-36-33_aPmC8jt.jpeg
https://uploads-ssl.webflow.com/63cc2f4cd802df3c3378884a/6465f7614311273dda480859_omer.jpeg
https://uploads-ssl.webflow.com/63cc2f4cd802df3c3378884a/6465f7616174bc9ab6f218db_chayim-cartoon.jpeg
https://uploads-ssl.webflow.com/63cc2f4cd802df3c3378884a/6465f761dcb0a00eb039fe15_alon-nisser.jpeg
https://uploads-ssl.webflow.com/63cc2f4cd802df3c3378884a/6465f761dcb0a00eb039fe18_alon-nisser.jpeg
https://uploads-ssl.webflow.com/63cc2f4cd802df3c3378884a/6465f761ee5ad19ad30544ec_1670281354562.jpeg
https://uploads-ssl.webflow.com/63cc2f4cd802df3c3378884a/6465f762348bdedaba377df7_20221020_171122.jpeg
https://uploads-ssl.webflow.com/63cc2f4cd802df3c3378884a/6465f762dd8cbdcadca3de0a_pini_reisman.jpeg
https://uploads-ssl.webflow.com/63cc2f4cd802df3c3378884a/6465f762fdb086cb2559ef6d_4082578.jpeg
https://uploads-ssl.webflow.com/63cc2f4cd802df3c3378884a/6465f762fdb086cb2559ef73_4082578.jpeg
https://uploads-ssl.webflow.com/63cc2f4cd802df3c3378884a/646668a21dac5d6740b01175_Gabor.Szabo.png
https://uploads-ssl.webflow.com/63cc2f4cd802df3c3378884a/646668a21dac5d6740b01178_Gabor.Szabo.png
https://uploads-ssl.webflow.com/63cc2f4cd802df3c3378884a/646668a3c11038f4a010a64c_Gil_Zilberfeld_Portrait_400x400.png
https://uploads-ssl.webflow.com/63cc2f4cd802df3c3378884a/64666a508cfe07046a3218ba_user-p-500.png
https://uploads-ssl.webflow.com/63cc2f4cd802df3c3378884a/64666a508cfe07046a3218ba_user.png
https://uploads-ssl.webflow.com/63cc2f4cd802df3c3378884a/64666a508cfe07046a3218ba_user.png
https://uploads-ssl.webflow.com/63cc2f4cd802df3c3378884a/6466749bbc3b9b7f16db58e6_batel-ziony.jpg
https://uploads-ssl.webflow.com/63cc2f4cd802df3c3378884a/6466749bbc3b9b7f16db58e6_batel-ziony-p-500.jpg
https://uploads-ssl.webflow.com/63cc2f4cd802df3c3378884a/6466749bbc3b9b7f16db58e6_batel-ziony.jpg
https://uploads-ssl.webflow.com/63cc2f4cd802df3c3378884a/646a144ad666dad4a2111162_8.jpg
https://uploads-ssl.webflow.com/63cc2f4cd802df3c3378884a/646a144ad666dad4a2111162_8-p-500.jpg
https://uploads-ssl.webflow.com/63cc2f4cd802df3c3378884a/646a144ad666dad4a2111162_8-p-800.jpg
https://uploads-ssl.webflow.com/63cc2f4cd802df3c3378884a/646a144ad666dad4a2111162_8-p-1080.jpg
https://uploads-ssl.webflow.com/63cc2f4cd802df3c3378884a/646a144ad666dad4a2111162_8-p-1600.jpg
https://uploads-ssl.webflow.com/63cc2f4cd802df3c3378884a/646a144ad666dad4a2111162_8-p-2000.jpg
https://uploads-ssl.webflow.com/63cc2f4cd802df3c3378884a/646a144ad666dad4a2111162_8-p-2600.jpg
https://uploads-ssl.webflow.com/63cc2f4cd802df3c3378884a/646a144ad666dad4a2111162_8-p-3200.jpg
https://uploads-ssl.webflow.com/63cc2f4cd802df3c3378884a/646a144ad666dad4a2111162_8.jpg
https://uploads-ssl.webflow.com/63cc2f4cd802df3c3378884a/646a14604df1a312259823be_9.jpg
https://uploads-ssl.webflow.com/63cc2f4cd802df3c3378884a/646a14604df1a312259823be_9-p-500.jpg
https://uploads-ssl.webflow.com/63cc2f4cd802df3c3378884a/646a14604df1a312259823be_9-p-800.jpg
https://uploads-ssl.webflow.com/63cc2f4cd802df3c3378884a/646a14604df1a312259823be_9-p-1080.jpg
https://uploads-ssl.webflow.com/63cc2f4cd802df3c3378884a/646a14604df1a312259823be_9-p-1600.jpg
https://uploads-ssl.webflow.com/63cc2f4cd802df3c3378884a/646a14604df1a312259823be_9-p-2000.jpg
https://uploads-ssl.webflow.com/63cc2f4cd802df3c3378884a/646a14604df1a312259823be_9-p-2600.jpg
https://uploads-ssl.webflow.com/63cc2f4cd802df3c3378884a/646a14604df1a312259823be_9-p-3200.jpg
https://uploads-ssl.webflow.com/63cc2f4cd802df3c3378884a/646a14604df1a312259823be_9.jpg
https://uploads-ssl.webflow.com/63cc2f4cd802df3c3378884a/6485fb362b03814fb6488d22_Screenshot%202023-06-11%20at%2019.48.01-p-500.png
https://uploads-ssl.webflow.com/63cc2f4cd802df3c3378884a/6485fb362b03814fb6488d22_Screenshot%202023-06-11%20at%2019.48.01-p-800.png
https://uploads-ssl.webflow.com/63cc2f4cd802df3c3378884a/6485fb362b03814fb6488d22_Screenshot%202023-06-11%20at%2019.48.01-p-1080.png
https://uploads-ssl.webflow.com/63cc2f4cd802df3c3378884a/6485fb362b03814fb6488d22_Screenshot%202023-06-11%20at%2019.48.01.png
https://uploads-ssl.webflow.com/63cc2f4cd802df3c3378884a/6485fb362b03814fb6488d22_Screenshot%202023-06-11%20at%2019.48.01.png
https://uploads-ssl.webflow.com/63cc2f4cd802df3c3378884a/6485fb51dcc1f215a88dc68b_pycon-il-logo-new.png
https://uploads-ssl.webflow.com/63cc2f4cd802df3c3378884a/6489c3b5f321cd15acb825d3_pycon-il-logo-new-2.png
https://uploads-ssl.webflow.com/63cc2f4cd802df3c3378884a/6489d4837595a3aae47f0b07_Mobileye%20logo%20-%20%D7%97%D7%93%D7%A9-p-500.png
https://uploads-ssl.webflow.com/63cc2f4cd802df3c3378884a/6489d4837595a3aae47f0b07_Mobileye%20logo%20-%20%D7%97%D7%93%D7%A9-p-800.png
https://uploads-ssl.webflow.com/63cc2f4cd802df3c3378884a/6489d4837595a3aae47f0b07_Mobileye%20logo%20-%20%D7%97%D7%93%D7%A9.png
https://uploads-ssl.webflow.com/63cc2f4cd802df3c3378884a/6489d4837595a3aae47f0b07_Mobileye%20logo%20-%20%D7%97%D7%93%D7%A9.png
https://uploads-ssl.webflow.com/63cc2f4cd802df3c3378884a/6489f8739647ea8ac7328696_Screenshot%202023-06-14%20at%2020.25.55-p-500.png
https://uploads-ssl.webflow.com/63cc2f4cd802df3c3378884a/6489f8739647ea8ac7328696_Screenshot%202023-06-14%20at%2020.25.55-p-800.png
https://uploads-ssl.webflow.com/63cc2f4cd802df3c3378884a/6489f8739647ea8ac7328696_Screenshot%202023-06-14%20at%2020.25.55-p-1080.png
https://uploads-ssl.webflow.com/63cc2f4cd802df3c3378884a/6489f8739647ea8ac7328696_Screenshot%202023-06-14%20at%2020.25.55.png
https://uploads-ssl.webflow.com/63cc2f4cd802df3c3378884a/6489f8739647ea8ac7328696_Screenshot%202023-06-14%20at%2020.25.55.png
https://uploads-ssl.webflow.com/63cc2f4cd802df3c3378884a/6489f88327d23bfee57a8a0b_Bluevine%20Logo_Bluevine%20Blue-p-500.png
https://uploads-ssl.webflow.com/63cc2f4cd802df3c3378884a/6489f88327d23bfee57a8a0b_Bluevine%20Logo_Bluevine%20Blue-p-800.png
https://uploads-ssl.webflow.com/63cc2f4cd802df3c3378884a/6489f88327d23bfee57a8a0b_Bluevine%20Logo_Bluevine%20Blue-p-1080.png
https://uploads-ssl.webflow.com/63cc2f4cd802df3c3378884a/6489f88327d23bfee57a8a0b_Bluevine%20Logo_Bluevine%20Blue-p-1600.png
https://uploads-ssl.webflow.com/63cc2f4cd802df3c3378884a/6489f88327d23bfee57a8a0b_Bluevine%20Logo_Bluevine%20Blue-p-2000.png
https://uploads-ssl.webflow.com/63cc2f4cd802df3c3378884a/6489f88327d23bfee57a8a0b_Bluevine%20Logo_Bluevine%20Blue-p-2600.png
https://uploads-ssl.webflow.com/63cc2f4cd802df3c3378884a/6489f88327d23bfee57a8a0b_Bluevine%20Logo_Bluevine%20Blue-p-3200.png
https://uploads-ssl.webflow.com/63cc2f4cd802df3c3378884a/6489f88327d23bfee57a8a0b_Bluevine%20Logo_Bluevine%20Blue.png
https://uploads-ssl.webflow.com/63cc2f4cd802df3c3378884a/6489f88327d23bfee57a8a0b_Bluevine%20Logo_Bluevine%20Blue.png
https://uploads-ssl.webflow.com/63cc2f4cd802df3c3378884a/6489f8bd9647ea8ac732d413_HAAT%20Logo.svg
https://uploads-ssl.webflow.com/63cc2f4cd802df3c3378884a/6489f8ebe83859ea210973b6_hypposys%20(1).jpg
https://uploads-ssl.webflow.com/63cc2f4cd802df3c3378884a/6489f8ebe83859ea210973b6_hypposys%20(1)-p-500.jpg
https://uploads-ssl.webflow.com/63cc2f4cd802df3c3378884a/6489f8ebe83859ea210973b6_hypposys%20(1).jpg
https://uploads-ssl.webflow.com/63cc2f4cd802df3c3378884a/6489f916e83859ea21099ca2_OwnBackup%20Logo%20Black-p-500.png
https://uploads-ssl.webflow.com/63cc2f4cd802df3c3378884a/6489f916e83859ea21099ca2_OwnBackup%20Logo%20Black-p-800.png
https://uploads-ssl.webflow.com/63cc2f4cd802df3c3378884a/6489f916e83859ea21099ca2_OwnBackup%20Logo%20Black-p-1080.png
https://uploads-ssl.webflow.com/63cc2f4cd802df3c3378884a/6489f916e83859ea21099ca2_OwnBackup%20Logo%20Black-p-1600.png
https://uploads-ssl.webflow.com/63cc2f4cd802df3c3378884a/6489f916e83859ea21099ca2_OwnBackup%20Logo%20Black.png
https://uploads-ssl.webflow.com/63cc2f4cd802df3c3378884a/6489f916e83859ea21099ca2_OwnBackup%20Logo%20Black.png
https://uploads-ssl.webflow.com/63cc2f4cd802df3c3378884a/6489f95863b5f84bfe89beca_Screenshot%202023-06-14%20at%2017.43.33-p-500.png
https://uploads-ssl.webflow.com/63cc2f4cd802df3c3378884a/6489f95863b5f84bfe89beca_Screenshot%202023-06-14%20at%2017.43.33.png
https://uploads-ssl.webflow.com/63cc2f4cd802df3c3378884a/6489f95863b5f84bfe89beca_Screenshot%202023-06-14%20at%2017.43.33.png
https://uploads-ssl.webflow.com/63cc2f4cd802df3c3378884a/6489f9d098b7ee9a9288ad81_RL%20Logo.svg
https://uploads-ssl.webflow.com/63cc2f4cd802df3c3378884a/64946fa2fa10e7451130b3c1_Screenshot%202023-06-22%20at%2018.58.17-p-500.png
https://uploads-ssl.webflow.com/63cc2f4cd802df3c3378884a/64946fa2fa10e7451130b3c1_Screenshot%202023-06-22%20at%2018.58.17-p-800.png
https://uploads-ssl.webflow.com/63cc2f4cd802df3c3378884a/64946fa2fa10e7451130b3c1_Screenshot%202023-06-22%20at%2018.58.17-p-1080.png
https://uploads-ssl.webflow.com/63cc2f4cd802df3c3378884a/64946fa2fa10e7451130b3c1_Screenshot%202023-06-22%20at%2018.58.17.png
https://uploads-ssl.webflow.com/63cc2f4cd802df3c3378884a/64946fa2fa10e7451130b3c1_Screenshot%202023-06-22%20at%2018.58.17.png
https://uploads-ssl.webflow.com/63cc2f4cd802df3c5b78883f/63cc2f4cd802df04d6788875_bg-speakers-section-02-events-template.svg
https://uploads-ssl.webflow.com/63cc2f4cd802df3c5b78883f/63cc2f4cd802df072b788874_bg-about-marketers-02-events-template.svg
https://uploads-ssl.webflow.com/63cc2f4cd802df3c5b78883f/63cc2f4cd802df10c9788876_bg-speakers-section-05-events-template.svg
https://uploads-ssl.webflow.com/63cc2f4cd802df3c5b78883f/63cc2f4cd802df2480788877_bg-speakers-section-04-events-template.svg
https://uploads-ssl.webflow.com/63cc2f4cd802df3c5b78883f/63cc2f4cd802df2d0d7888a4_icon-schedule-events-template.svg
https://uploads-ssl.webflow.com/63cc2f4cd802df3c5b78883f/63cc2f4cd802df4b507888a7_bg-about-marketers-03-events-template.svg
https://uploads-ssl.webflow.com/63cc2f4cd802df3c5b78883f/63cc2f4cd802df710f7888a8_bg-speaker-01-evently-template.svg
https://uploads-ssl.webflow.com/63cc2f4cd802df3c5b78883f/63cc2f4cd802df85eb7888c8_bg-about-us-04-evently-template.svg
https://uploads-ssl.webflow.com/63cc2f4cd802df3c5b78883f/63cc2f4cd802df860f7888dd_bg-about-us-03-evently-template.svg
https://uploads-ssl.webflow.com/63cc2f4cd802df3c5b78883f/63cc2f4cd802dfb2177888c5_bg-about-us-02-evently-template.svg
https://uploads-ssl.webflow.com/63cc2f4cd802df3c5b78883f/63cc2f4cd802dfb72378887b_bg-speakers-section-01-events-template.svg
https://uploads-ssl.webflow.com/63cc2f4cd802df3c5b78883f/63cc2f4cd802dfc8337888ce_bg-about-us-01-evently-template.svg
https://uploads-ssl.webflow.com/63cc2f4cd802df3c5b78883f/63cc2f4cd802dfca84788879_bg-speakers-section-06-events-template.svg
https://uploads-ssl.webflow.com/63cc2f4cd802df3c5b78883f/63cc2f4cd802dfd4c37888b5_icon-date-event-evently-template.svg
https://uploads-ssl.webflow.com/63cc2f4cd802df3c5b78883f/63cc2f4cd802dfe5d37888ab_bg-speaker-02-evently-template.svg
https://uploads-ssl.webflow.com/63cc2f4cd802df3c5b78883f/63cc2f4cd802dfe70f7888ae_bg-speakers-section-03-events-template.svg
https://uploads-ssl.webflow.com/63cc2f4cd802df3c5b78883f/63cc2f4cd802dff311788873_bg-about-marketers-01-events-template.svg
https://uploads-ssl.webflow.com/63cc2f4cd802df3c5b78883f/63d96b20ec7b288140f6e2ba_output-onlinepngtools.png
https://uploads-ssl.webflow.com/63cc2f4cd802df3c5b78883f/63dd00523f1b166ce8c0b25b_63d96b20ec7b288140f6e2ba_output-onlinepngtools.png
https://uploads-ssl.webflow.com/63cc2f4cd802df3c5b78883f/63dd7122306e8966d05676cc_youtube-logo-icone-grise-p-500.png
https://uploads-ssl.webflow.com/63cc2f4cd802df3c5b78883f/63dd7122306e8966d05676cc_youtube-logo-icone-grise.png
https://uploads-ssl.webflow.com/63cc2f4cd802df3c5b78883f/63dd7122306e8966d05676cc_youtube-logo-icone-grise.png
https://uploads-ssl.webflow.com/63cc2f4cd802df3c5b78883f/63e29d87c52632066fb2f452_pyconicon-2.png
https://uploads-ssl.webflow.com/63cc2f4cd802df3c5b78883f/63e29de32883b15ac13185a9_pycon-il-logo-new-2.png
https://uploads-ssl.webflow.com/63cc2f4cd802df3c5b78883f/63f522e7443f3271c7ced84e_mastodon-3628320-3031928.png
https://uploads-ssl.webflow.com/63cc2f4cd802df3c5b78883f/6453721a6b1a1307fdfcd839_person-michal-afek.png
https://uploads-ssl.webflow.com/63cc2f4cd802df3c5b78883f/6453721a6f9c7016a5b8ecf5_person-ron-alfia.png
https://uploads-ssl.webflow.com/63cc2f4cd802df3c5b78883f/6453721ac1a0e63451418e53_person-lior-mizrahi.png
https://uploads-ssl.webflow.com/63cc2f4cd802df3c5b78883f/6453721b71f00967ba9db7fc_person-yotam-perkal.png
https://uploads-ssl.webflow.com/63cc2f4cd802df3c5b78883f/6458e3731d08c5178b3dbcfe_pycon-pypods-graphic-p-500.png
https://uploads-ssl.webflow.com/63cc2f4cd802df3c5b78883f/6458e3731d08c5178b3dbcfe_pycon-pypods-graphic-p-800.png
https://uploads-ssl.webflow.com/63cc2f4cd802df3c5b78883f/6458e3731d08c5178b3dbcfe_pycon-pypods-graphic-p-1080.png
https://uploads-ssl.webflow.com/63cc2f4cd802df3c5b78883f/6458e3731d08c5178b3dbcfe_pycon-pypods-graphic.png
https://uploads-ssl.webflow.com/63cc2f4cd802df3c5b78883f/6458e3731d08c5178b3dbcfe_pycon-pypods-graphic.png
https://uploads-ssl.webflow.com/63cc2f4cd802df3c5b78883f/6489c5c4c8a48752252a10a0_RL%20Logo.svg
https://uploads-ssl.webflow.com/63cc2f4cd802df3c5b78883f/6489c5cb8d5c146f7fce38e9_OwnBackup%20Logo%20Black-p-500.png
https://uploads-ssl.webflow.com/63cc2f4cd802df3c5b78883f/6489c5cb8d5c146f7fce38e9_OwnBackup%20Logo%20Black-p-800.png
https://uploads-ssl.webflow.com/63cc2f4cd802df3c5b78883f/6489c5cb8d5c146f7fce38e9_OwnBackup%20Logo%20Black-p-1080.png
https://uploads-ssl.webflow.com/63cc2f4cd802df3c5b78883f/6489c5cb8d5c146f7fce38e9_OwnBackup%20Logo%20Black-p-1600.png
https://uploads-ssl.webflow.com/63cc2f4cd802df3c5b78883f/6489c5cb8d5c146f7fce38e9_OwnBackup%20Logo%20Black.png
https://uploads-ssl.webflow.com/63cc2f4cd802df3c5b78883f/6489c5cb8d5c146f7fce38e9_OwnBackup%20Logo%20Black.png
https://uploads-ssl.webflow.com/63cc2f4cd802df3c5b78883f/6489c5ce4fbc8a8704e439fe_Mobileye%20logo%20-%20%D7%97%D7%93%D7%A9-p-500.png
https://uploads-ssl.webflow.com/63cc2f4cd802df3c5b78883f/6489c5ce4fbc8a8704e439fe_Mobileye%20logo%20-%20%D7%97%D7%93%D7%A9-p-800.png
https://uploads-ssl.webflow.com/63cc2f4cd802df3c5b78883f/6489c5ce4fbc8a8704e439fe_Mobileye%20logo%20-%20%D7%97%D7%93%D7%A9.png
https://uploads-ssl.webflow.com/63cc2f4cd802df3c5b78883f/6489c5ce4fbc8a8704e439fe_Mobileye%20logo%20-%20%D7%97%D7%93%D7%A9.png
https://uploads-ssl.webflow.com/63cc2f4cd802df3c5b78883f/6489c6f926fad2580b7c46f7_hypposys%20(1).jpg
https://uploads-ssl.webflow.com/63cc2f4cd802df3c5b78883f/6489c6f926fad2580b7c46f7_hypposys%20(1)-p-500.jpg
https://uploads-ssl.webflow.com/63cc2f4cd802df3c5b78883f/6489c6f926fad2580b7c46f7_hypposys%20(1).jpg
https://uploads-ssl.webflow.com/63cc2f4cd802df3c5b78883f/6489c77c4968258e9086c6f0_HAAT%20Logo.svg
https://uploads-ssl.webflow.com/63cc2f4cd802df3c5b78883f/6489c77cf5053db0b307f2d7_Bluevine%20Logo_Bluevine%20Blue-p-500.png
https://uploads-ssl.webflow.com/63cc2f4cd802df3c5b78883f/6489c77cf5053db0b307f2d7_Bluevine%20Logo_Bluevine%20Blue-p-800.png
https://uploads-ssl.webflow.com/63cc2f4cd802df3c5b78883f/6489c77cf5053db0b307f2d7_Bluevine%20Logo_Bluevine%20Blue-p-1080.png
https://uploads-ssl.webflow.com/63cc2f4cd802df3c5b78883f/6489c77cf5053db0b307f2d7_Bluevine%20Logo_Bluevine%20Blue-p-1600.png
https://uploads-ssl.webflow.com/63cc2f4cd802df3c5b78883f/6489c77cf5053db0b307f2d7_Bluevine%20Logo_Bluevine%20Blue-p-2000.png
https://uploads-ssl.webflow.com/63cc2f4cd802df3c5b78883f/6489c77cf5053db0b307f2d7_Bluevine%20Logo_Bluevine%20Blue-p-2600.png
https://uploads-ssl.webflow.com/63cc2f4cd802df3c5b78883f/6489c77cf5053db0b307f2d7_Bluevine%20Logo_Bluevine%20Blue-p-3200.png
https://uploads-ssl.webflow.com/63cc2f4cd802df3c5b78883f/6489c77cf5053db0b307f2d7_Bluevine%20Logo_Bluevine%20Blue.png
https://uploads-ssl.webflow.com/63cc2f4cd802df3c5b78883f/6489c77cf5053db0b307f2d7_Bluevine%20Logo_Bluevine%20Blue.png
https://uploads-ssl.webflow.com/63cc2f4cd802df3c5b78883f/6489d229112436214db3b25c_Screenshot%202023-06-14%20at%2017.43.33-p-500.png
https://uploads-ssl.webflow.com/63cc2f4cd802df3c5b78883f/6489d229112436214db3b25c_Screenshot%202023-06-14%20at%2017.43.33.png
https://uploads-ssl.webflow.com/63cc2f4cd802df3c5b78883f/6489d229112436214db3b25c_Screenshot%202023-06-14%20at%2017.43.33.png
https://uploads-ssl.webflow.com/63cc2f4cd802df3c5b78883f/64946eba89be146aea61da62_Permit.io%20logo%20positive%20vertical.svg
https://uploads-ssl.webflow.com/63cc2f4cd802df3c5b78883f/649c37280dbb22ef25e501be_biocatch-logos-idF5GRskJ5.svg
https://uploads-ssl.webflow.com/63cc2f4cd802df3c5b78883f/649c372cc64b4a2c43bc7b68_Microsoft-Logo.wine.svg
https://uploads-ssl.webflow.com/63cc2f4cd802df3c5b78883f/649dbce71a94acbfe6d30e1b_logo-MAX-IMPACT%20(2)%20(2)-p-500.png
https://uploads-ssl.webflow.com/63cc2f4cd802df3c5b78883f/649dbce71a94acbfe6d30e1b_logo-MAX-IMPACT%20(2)%20(2).png
https://uploads-ssl.webflow.com/63cc2f4cd802df3c5b78883f/649dbce71a94acbfe6d30e1b_logo-MAX-IMPACT%20(2)%20(2).png
https://uploads-ssl.webflow.com/63cc2f4cd802df3c5b78883f/649dbcfbfb204ab5be306926_Hamakor_butterfly.png
https://uploads-ssl.webflow.com/63cc2f4cd802df3c5b78883f/649dbd29977dc53d3bf37143_IMG-20230628-WA0000%20(1).jpg
https://uploads-ssl.webflow.com/63cc2f4cd802df3c5b78883f/css/pycon-israel-2023.webflow.c47b99761.css
https://uploads-ssl.webflow.com/63cc2f4cd802df3c5b78883f/js/webflow.acaffe362.js
https://webflow.com/
