<?xml version="1.0" encoding="UTF-8"?>
<!-- Generator: Adobe Illustrator 16.0.0, SVG Export Plug-In . SVG Version: 6.00 Build 0)  -->
<!DOCTYPE svg PUBLIC "-//W3C//DTD SVG 1.1//EN" "http://www.w3.org/Graphics/SVG/1.1/DTD/svg11.dtd">
<svg version="1.1" id="Layer_1" xmlns="http://www.w3.org/2000/svg" xmlns:xlink="http://www.w3.org/1999/xlink" x="0px" y="0px" width="1862px" height="560px" viewBox="0 0 1862 560" enable-background="new 0 0 1862 560" xml:space="preserve">
<g>
	<path fill="#1729E7" d="M1423.859,447.75h15.25v-305h-15.25V447.75z M1393.361,447.75h15.25v-305h-15.25V447.75z M1362.859,447.75   h15.25v-305h-15.25V447.75z M1332.359,447.75h15.25v-305h-15.25V447.75z"/>
	<g>
		<path fill="#1729E7" d="M603.298,447.75h15.251V297.367c0-22.45-7.027-40.063-21.075-52.846    c-14.053-12.776-32.443-19.167-55.176-19.167c-20.618,0-37.774,6.777-51.469,20.333c-13.697,13.556-20.545,30.075-20.545,49.562    c0,12.569,2.151,23.688,6.46,33.357c4.306,9.676,10.13,17.301,17.475,22.877c7.339,5.578,15.494,9.742,24.463,12.497    c8.965,2.752,18.532,4.129,28.699,4.129c15.813,0,30.57-3.601,44.268-10.802v-15.25c-13.273,7.91-27.958,11.861-44.055,11.861    c-6.639,0-12.887-0.635-18.746-1.907c-5.86-1.27-11.474-3.353-16.838-6.248c-5.368-2.891-9.992-6.564-13.873-11.013    c-3.885-4.448-6.957-10.025-9.214-16.732c-2.26-6.706-3.389-14.298-3.389-22.77c0-14.966,5.576-27.816,16.733-38.549    c11.153-10.729,24.496-16.098,40.031-16.098c18.354,0,33.111,4.944,44.267,14.826c11.154,9.886,16.733,23.865,16.733,41.938    V447.75z M635.068,243.146c-9.318-15.674-22.026-27.641-38.125-35.9c-16.096-8.262-34.312-12.393-54.646-12.393    c-28.947,0-53.269,9.781-72.967,29.336c-19.698,19.56-29.547,43.245-29.547,71.062c0,16.382,2.893,31.172,8.684,44.373    c5.789,13.205,13.625,23.935,23.51,32.194c9.883,8.26,21.108,14.546,33.678,18.851c12.566,4.31,25.839,6.461,39.819,6.461    c15.532,0,30.923-3.178,46.174-9.531V371.5c-14.545,7.484-29.865,11.225-45.962,11.225c-11.861,0-23.123-1.8-33.783-5.399    c-10.662-3.602-20.3-8.86-28.912-15.78c-8.613-6.917-15.428-16.098-20.439-27.534c-5.013-11.438-7.518-24.358-7.518-38.761    c0-23.723,8.329-43.844,24.992-60.365c16.66-16.52,37.417-24.781,62.271-24.781c26.827,0,48.785,7.873,65.871,23.617    c17.085,15.746,25.629,36.96,25.629,63.646V447.75h15.25V297.367C649.048,276.896,644.388,258.819,635.068,243.146     M661.544,227.895c-12.002-20.333-28.418-36.006-49.244-47.02c-20.83-11.014-44.161-16.521-70.002-16.521    c-18.499,0-36.007,3.462-52.528,10.379c-16.521,6.92-30.642,16.239-42.361,27.958c-11.722,11.723-21.005,25.629-27.852,41.727    c-6.851,16.097-10.272,33.042-10.272,50.833c0,24.994,6.142,47.587,18.427,67.776c12.284,20.196,28.662,35.797,49.138,46.811    c20.472,11.013,42.924,16.52,67.354,16.52c15.532,0,31.347-3.033,47.445-9.107v-15.461c-15.393,6.638-31.066,9.954-47.021,9.954    c-15.673,0-30.678-2.646-45.008-7.942c-14.333-5.295-27.111-12.742-38.337-22.346c-11.225-9.601-20.157-21.85-26.792-36.748    c-6.64-14.896-9.956-31.379-9.956-49.456c0-21.038,5.117-40.382,15.356-58.034c10.237-17.65,24.391-31.666,42.467-42.044    c18.074-10.379,38.052-15.567,59.941-15.567c23.014,0,43.771,4.802,62.271,14.401c18.496,9.604,33.075,23.405,43.738,41.409    c10.66,18.003,15.991,38.653,15.991,61.952V447.75h15.251V297.367C679.549,271.389,673.545,248.229,661.544,227.895     M697.128,230.437c-8.614-20.473-20.406-37.733-35.372-51.786c-14.968-14.049-32.76-25.027-53.374-32.935    c-20.619-7.908-42.646-11.862-66.084-11.862c-23.017,0-44.727,4.273-65.13,12.814c-20.406,8.545-37.774,20.052-52.103,34.525    c-14.335,14.475-25.629,31.631-33.89,51.468c-8.261,19.84-12.391,40.704-12.391,62.589c0,19.062,2.966,37.138,8.896,54.221    c5.93,17.087,14.117,32.02,24.569,44.799c10.448,12.78,22.557,23.864,36.325,33.252c13.767,9.395,28.733,16.488,44.903,21.287    c16.167,4.799,32.794,7.201,49.88,7.201c16.521,0,32.618-2.752,48.292-8.26v-15.673c-14.969,6.354-30.785,9.53-47.445,9.53    c-15.111,0-29.97-2.187-44.585-6.566c-14.614-4.374-28.243-10.802-40.878-19.273c-12.639-8.472-23.795-18.533-33.465-30.184    c-9.674-11.649-17.3-25.274-22.875-40.878c-5.579-15.602-8.366-32.087-8.366-49.456c0-26.403,6.493-50.797,19.485-73.178    c12.99-22.381,30.851-40.139,53.587-53.271c22.732-13.132,47.796-19.697,75.191-19.697c28.521,0,54.362,6.179,77.521,18.533    c23.156,12.357,41.441,29.864,54.857,52.527c13.413,22.664,20.122,48.397,20.122,77.203V447.75h15.25V297.367    C710.048,273.222,705.738,250.913,697.128,230.437"/>
		<path fill="#1729E7" d="M850.044,97h-15.252v195.498c0,22.45,7.027,40.063,21.076,52.846    c14.053,12.776,32.441,19.167,55.176,19.167c20.617,0,37.774-6.777,51.469-20.333c13.697-13.556,20.545-30.075,20.545-49.562    c0-12.57-2.15-23.689-6.461-33.358c-4.305-9.674-10.129-17.299-17.475-22.876c-7.338-5.579-15.494-9.743-24.463-12.497    c-8.965-2.752-18.531-4.13-28.699-4.13c-15.812,0-30.57,3.602-44.268,10.803v15.249c13.273-7.909,27.957-11.861,44.055-11.861    c6.641,0,12.887,0.636,18.746,1.907s11.475,3.354,16.838,6.248c5.369,2.894,9.992,6.566,13.873,11.015    c3.885,4.447,6.957,10.023,9.215,16.731c2.26,6.705,3.389,14.297,3.389,22.77c0,14.966-5.576,27.815-16.732,38.549    c-11.154,10.729-24.497,16.098-40.032,16.098c-18.355,0-33.111-4.944-44.268-14.826c-11.154-9.886-16.732-23.866-16.732-41.938V97    z M818.273,346.719c9.318,15.674,22.027,27.64,38.125,35.902c16.098,8.26,34.312,12.39,54.646,12.39    c28.948,0,53.268-9.781,72.967-29.335c19.697-19.559,29.547-43.246,29.547-71.062c0-16.382-2.893-31.173-8.684-44.374    c-5.789-13.203-13.625-23.934-23.51-32.194c-9.885-8.259-21.109-14.544-33.68-18.851c-12.565-4.308-25.838-6.46-39.819-6.46    c-15.531,0-30.924,3.178-46.174,9.531v16.098c14.545-7.485,29.865-11.226,45.963-11.226c11.859,0,23.121,1.801,33.782,5.4    c10.664,3.602,20.303,8.86,28.912,15.78c8.615,6.916,15.43,16.098,20.439,27.534c5.014,11.438,7.518,24.357,7.518,38.761    c0,23.723-8.328,43.845-24.992,60.364c-16.658,16.521-37.417,24.781-62.27,24.781c-26.828,0-48.785-7.873-65.873-23.616    c-17.082-15.747-25.627-36.961-25.627-63.646V97h-15.25v195.498C804.294,312.97,808.955,331.045,818.273,346.719 M791.798,361.969    c12.002,20.333,28.418,36.006,49.244,47.021c20.83,11.015,44.16,16.521,70.002,16.521c18.5,0,36.006-3.463,52.528-10.379    c16.521-6.919,30.643-16.239,42.359-27.958c11.725-11.723,21.008-25.628,27.854-41.728c6.852-16.097,10.273-33.041,10.273-50.832    c0-24.993-6.143-47.588-18.428-67.777c-12.285-20.195-28.662-35.795-49.139-46.809c-20.473-11.014-42.924-16.521-67.354-16.521    c-15.533,0-31.348,3.035-47.445,9.108v15.461c15.393-6.639,31.066-9.955,47.021-9.955c15.674,0,30.678,2.647,45.008,7.942    c14.334,5.295,27.111,12.741,38.338,22.347c11.225,9.6,20.156,21.849,26.793,36.747c6.639,14.896,9.955,31.381,9.955,49.457    c0,21.037-5.117,40.382-15.355,58.033c-10.238,17.65-24.393,31.667-42.469,42.044c-18.072,10.38-38.051,15.569-59.94,15.569    c-23.014,0-43.771-4.802-62.271-14.404c-18.496-9.604-33.074-23.402-43.738-41.407c-10.66-18.004-15.99-38.653-15.99-61.952V97    h-15.252v195.498C773.792,318.475,779.798,341.636,791.798,361.969 M756.214,359.427c8.614,20.473,20.407,37.735,35.372,51.787    c14.969,14.049,32.76,25.026,53.375,32.936c20.619,7.906,42.645,11.86,66.084,11.86c23.016,0,44.727-4.272,65.129-12.814    c20.406-8.544,37.775-20.052,52.105-34.523c14.334-14.476,25.629-31.632,33.889-51.469c8.26-19.84,12.391-40.703,12.391-62.589    c0-19.062-2.967-37.139-8.896-54.222c-5.93-17.087-14.117-32.019-24.568-44.797c-10.449-12.782-22.557-23.865-36.326-33.253    c-13.766-9.393-28.732-16.489-44.902-21.287c-16.166-4.798-32.793-7.202-49.881-7.202c-16.52,0-32.617,2.753-48.291,8.26v15.674    c14.969-6.353,30.785-9.531,47.445-9.531c15.111,0,29.971,2.188,44.584,6.566c14.615,4.375,28.244,10.802,40.879,19.275    c12.639,8.471,23.795,18.533,33.465,30.182c9.674,11.65,17.301,25.274,22.875,40.878c5.578,15.602,8.365,32.089,8.365,49.457    c0,26.402-6.492,50.798-19.484,73.179c-12.99,22.379-30.852,40.138-53.588,53.27c-22.73,13.132-47.795,19.698-75.19,19.698    c-28.521,0-54.361-6.179-77.521-18.533c-23.156-12.357-41.441-29.865-54.857-52.528c-13.413-22.663-20.122-48.396-20.122-77.202    V97h-15.25v195.498C743.294,316.643,747.603,338.951,756.214,359.427"/>
	</g>
	<path fill="#1729E7" d="M1299.115,142.75h-191.311v305h15.25V158.001h176.061V142.75z M1299.115,173.25h-160.811v274.5h15.25   V188.501h145.561V173.25z M1299.115,203.75h-130.311v244h15.25V219h115.061V203.75z M1299.115,234.25h-99.811v213.5h15.25V249.501   h84.561V234.25z"/>
	<g>
		<path fill="#1729E7" d="M1698.385,344.508l-10.963-10.964c-5.729,7.011-12.627,12.546-20.734,16.564    c-8.26,4.096-17.123,6.142-26.582,6.142c-16.805,0-31.172-5.964-43.102-17.897c-11.934-11.933-17.898-26.297-17.898-43.102    c0-16.804,5.965-31.17,17.898-43.104c11.93-11.93,26.297-17.898,43.102-17.898c19.273,0,35.039,7.579,47.305,22.719l10.891-10.891    c-6.795-8.049-14.996-14.543-24.729-19.346c-10.451-5.154-21.605-7.731-33.467-7.731c-21.041,0-39.008,7.45-53.902,22.346    c-14.9,14.897-22.348,32.865-22.348,53.905c0,21.039,7.447,39.007,22.348,53.903c14.895,14.899,32.861,22.346,53.902,22.346    c11.721,0,22.803-2.505,33.254-7.521C1683.232,359.245,1691.537,352.712,1698.385,344.508 M1719.814,365.938l-10.742-10.744    c-8.01,9.284-17.592,16.798-28.936,22.344c-12.568,6.143-25.912,9.212-40.031,9.212c-25.277,0-46.844-8.964-64.705-26.898    c-17.863-17.932-26.793-39.465-26.793-64.6c0-25.133,8.93-46.667,26.793-64.602c17.861-17.931,39.428-26.9,64.705-26.9    c14.119,0,27.43,3.038,39.928,9.109c11.369,5.524,20.986,13.081,29.025,22.461l10.787-10.787    c-9.209-10.517-20.146-19.047-33.037-25.336c-14.613-7.129-30.182-10.696-46.703-10.696c-19.346,0-37.207,4.767-53.586,14.296    c-16.383,9.532-29.336,22.489-38.865,38.868c-9.531,16.381-14.299,34.242-14.299,53.587c0,19.347,4.768,37.207,14.299,53.585    c9.529,16.383,22.482,29.336,38.865,38.866c16.379,9.531,34.24,14.297,53.586,14.297c16.521,0,32.055-3.563,46.598-10.694    C1699.611,384.978,1710.576,376.438,1719.814,365.938 M1741.543,387.665l-10.855-10.854    c-10.494,11.604-22.816,21.083-37.205,28.154c-16.664,8.191-34.455,12.284-53.377,12.284c-16.52,0-32.301-3.21-47.338-9.636    c-15.039-6.425-28.029-15.109-38.971-26.053c-10.945-10.941-19.629-23.935-26.053-38.973c-6.428-15.039-9.637-30.816-9.637-47.337    c0-16.521,3.209-32.301,9.637-47.341c6.424-15.037,15.107-28.027,26.053-38.972c10.941-10.941,23.932-19.625,38.971-26.052    c15.037-6.423,30.818-9.637,47.338-9.637c18.922,0,36.713,4.097,53.377,12.285c14.389,7.075,26.709,16.554,37.203,28.157    l10.898-10.897c-11.691-12.845-25.486-23.203-41.43-31.028c-18.713-9.176-38.729-13.767-60.049-13.767    c-18.639,0-36.43,3.638-53.375,10.909c-16.943,7.274-31.525,17.018-43.736,29.229c-12.215,12.215-21.959,26.793-29.23,43.737    c-7.273,16.944-10.908,34.736-10.908,53.376c0,18.638,3.635,36.43,10.908,53.374c7.271,16.943,17.016,31.525,29.23,43.738    c12.211,12.214,26.793,21.957,43.736,29.229c16.945,7.272,34.736,10.907,53.375,10.907c21.182,0,41.092-4.554,59.73-13.662    C1715.891,410.993,1729.785,400.594,1741.543,387.665 M1763.107,181.271c-14.076-15.222-30.623-27.563-49.715-36.932    c-22.877-11.225-47.307-16.838-73.287-16.838c-22.734,0-44.445,4.447-65.131,13.343s-38.514,20.83-53.479,35.796    c-14.969,14.968-26.9,32.796-35.795,53.48c-8.896,20.688-13.346,42.398-13.346,65.132s4.449,44.444,13.346,65.13    c8.895,20.688,20.826,38.516,35.795,53.48c14.965,14.969,32.793,26.899,53.479,35.796c20.686,8.895,42.396,13.343,65.131,13.343    c25.98,0,50.375-5.613,73.18-16.839c19.109-9.408,35.684-21.757,49.789-36.968l-10.781-10.779    c-12.949,14.061-28.195,25.439-45.785,34.086c-20.688,10.167-42.822,15.248-66.402,15.248c-20.617,0-40.348-4.021-59.197-12.07    c-18.854-8.05-35.09-18.884-48.715-32.514c-13.631-13.625-24.467-29.863-32.514-48.716c-8.049-18.85-12.074-38.58-12.074-59.197    c0-20.614,4.025-40.351,12.074-59.2c8.047-18.852,18.883-35.088,32.514-48.716c13.625-13.625,29.861-24.464,48.715-32.512    c18.85-8.049,38.58-12.073,59.197-12.073c23.58,0,45.715,5.083,66.402,15.249c17.59,8.648,32.836,20.029,45.785,34.085    L1763.107,181.271z"/>
	</g>
	<rect x="146.187" y="96.999" fill="#1729E7" width="15.25" height="350.751"/>
	<polygon fill="#1729E7" points="176.686,97 176.686,447.751 191.937,447.751 191.943,97  "/>
	<rect x="85.187" y="96.999" fill="#1729E7" width="15.251" height="350.751"/>
	<rect x="115.687" y="96.999" fill="#1729E7" width="15.251" height="350.751"/>
	<rect x="203.652" y="310.499" fill="#1729E7" width="134.641" height="15.25"/>
	<rect x="203.652" y="127.5" fill="#1729E7" width="141.842" height="15.25"/>
	<rect x="203.652" y="96.999" fill="#1729E7" width="141.843" height="15.25"/>
	<rect x="203.652" y="157.998" fill="#1729E7" width="141.842" height="15.251"/>
	<rect x="203.652" y="249.5" fill="#1729E7" width="134.641" height="15.25"/>
	<rect x="203.652" y="280" fill="#1729E7" width="134.641" height="15.249"/>
</g>
</svg>