{
	"id": "aff710e6-fc54-4ab4-bda4-21ee97d61cfa",
	"name": "HC2.0 API Environment",
	"values": [
		{
			"key": "risk",
			"value": "https://api-dev.halocheck.xyz",
			"type": "default",
			"enabled": true
		},
		{
			"key": "authentication",
			"value": "https://api-dev.halocheck.xyz",
			"type": "default",
			"enabled": true
		},
		{
			"key": "integration",
			"value": "https://api-dev.halocheck.xyz",
			"type": "default",
			"enabled": true
		},
		{
			"key": "secure",
			"value": "https://api-dev.halocheck.xyz",
			"type": "default",
			"enabled": true
		},
		{
			"key": "ACCESS_TOKEN",
			"value": "",
			"type": "any",
			"enabled": true
		},
		{
			"key": "company_A",
			"value": "",
			"type": "default",
			"enabled": true
		},
		{
			"key": "tenant_uuid",
			"value": "",
			"type": "any",
			"enabled": true
		},
		{
			"key": "randomName",
			"value": "",
			"type": "any",
			"enabled": true
		},
		{
			"key": "randomNameEdit",
			"value": "",
			"type": "any",
			"enabled": true
		},
		{
			"key": "tenant_uuid2",
			"value": "",
			"type": "any",
			"enabled": true
		},
		{
			"key": "randomEmail",
			"value": "",
			"type": "any",
			"enabled": true
		},
		{
			"key": "randomNewName",
			"value": "",
			"type": "any",
			"enabled": true
		},
		{
			"key": "profile_uuid",
			"value": "",
			"type": "any",
			"enabled": true
		},
		{
			"key": "randomAdminEmail",
			"value": "",
			"type": "any",
			"enabled": true
		},
		{
			"key": "admin_profile_uuid",
			"value": "",
			"type": "any",
			"enabled": true
		},
		{
			"key": "risk_uuid",
			"value": "",
			"type": "default",
			"enabled": true
		},
		{
			"key": "setting_path",
			"value": "",
			"type": "default",
			"enabled": true
		},
		{
			"key": "setting_id",
			"value": "",
			"type": "default",
			"enabled": true
		},
		{
			"key": "scheduler_id",
			"value": "",
			"type": "default",
			"enabled": true
		},
		{
			"key": "randomSettingName",
			"value": "",
			"type": "any",
			"enabled": true
		},
		{
			"key": "randomDataName",
			"value": "",
			"type": "any",
			"enabled": true
		},
		{
			"key": "randomData2Name",
			"value": "",
			"type": "any",
			"enabled": true
		},
		{
			"key": "randomSetting2Name",
			"value": "",
			"type": "any",
			"enabled": true
		},
		{
			"key": "randomRiskName",
			"value": "",
			"type": "any",
			"enabled": true
		},
		{
			"key": "randomRisk2Name",
			"value": "",
			"type": "any",
			"enabled": true
		},
		{
			"key": "randomTypeName",
			"value": "",
			"type": "any",
			"enabled": true
		},
		{
			"key": "randomType2Name",
			"value": "",
			"type": "any",
			"enabled": true
		},
		{
			"key": "randomTargetName",
			"value": "",
			"type": "any",
			"enabled": true
		},
		{
			"key": "adverse_media_uuid",
			"value": "",
			"type": "default",
			"enabled": true
		},
		{
			"key": "possible_matches_uuid",
			"value": "",
			"type": "default",
			"enabled": true
		},
		{
			"key": "risk_source_uuid",
			"value": "",
			"type": "default",
			"enabled": true
		},
		{
			"key": "randomPossibleMatchesName",
			"value": "",
			"type": "any",
			"enabled": true
		},
		{
			"key": "randomPossibleMatches2Name",
			"value": "",
			"type": "any",
			"enabled": true
		},
		{
			"key": "randomAdverseMedia2Name",
			"value": "",
			"type": "any",
			"enabled": true
		},
		{
			"key": "randomPublicTarget",
			"value": "",
			"type": "any",
			"enabled": true
		},
		{
			"key": "error_code",
			"value": "",
			"type": "default",
			"enabled": true
		},
		{
			"key": "randomAdverseMediaName",
			"value": "",
			"type": "any",
			"enabled": true
		},
		{
			"key": "action",
			"value": "",
			"type": "any",
			"enabled": true
		},
		{
			"key": "action_tenant",
			"value": "",
			"type": "any",
			"enabled": true
		},
		{
			"key": "action_admin",
			"value": "",
			"type": "any",
			"enabled": true
		},
		{
			"key": "randomTenantName",
			"value": "",
			"type": "any",
			"enabled": true
		},
		{
			"key": "randomTenantNameEdit",
			"value": "",
			"type": "any",
			"enabled": true
		},
		{
			"key": "randomTenantUserEmail",
			"value": "",
			"type": "any",
			"enabled": true
		},
		{
			"key": "randomTenantUserName",
			"value": "",
			"type": "any",
			"enabled": true
		},
		{
			"key": "randomTenantUserNewName",
			"value": "",
			"type": "any",
			"enabled": true
		},
		{
			"key": "randomStringForBulk",
			"value": "",
			"type": "any",
			"enabled": true
		},
		{
			"key": "randomTransactionString",
			"value": "",
			"type": "any",
			"enabled": true
		},
		{
			"key": "randomTransactionStringTenant",
			"value": "",
			"type": "any",
			"enabled": true
		},
		{
			"key": "bulk_id",
			"value": "",
			"type": "any",
			"enabled": true
		},
		{
			"key": "randomStringForBulkTenant",
			"value": "",
			"type": "any",
			"enabled": true
		},
		{
			"key": "TenantUserList",
			"value": "",
			"type": "any",
			"enabled": true
		},
		{
			"key": "risksourceID",
			"value": "",
			"type": "any",
			"enabled": true
		},
		{
			"key": "access_token_new",
			"value": "",
			"type": "any",
			"enabled": true
		},
		{
			"key": "TypeID",
			"value": "",
			"type": "any",
			"enabled": true
		}
	],
	"_postman_variable_scope": "environment",
	"_postman_exported_at": "2023-01-19T03:47:37.514Z",
	"_postman_exported_using": "Postman/10.8.1"
}