no,firstname,lastname,companyid,email,phone,password,created_by_id,updated_by_id
1,Eko,Prastius,1,prastius@google.com,334-212-1920,password,1,1
2,Ambrose,Giametti,1,giametti@ambrose.com,782-219-9191,password,1,1
3,Winnifred,Rivenzon,2,rivenzon@winnifred.com,758-218-5821,password,1,1
4,Claudelle,Briskey,3,cbriskey3@gravatar.com,552-120-7032,password,1,1
5,Moore,Jerrome,4,mjerrome4@linkedin.com,662-720-2728,password,1,1
6,Gabrila,Borley,5,gborley5@loc.gov,288-157-1475,password,1,1
7,Mitchel,Costain,6,mcostain6@devhub.com,968-566-6329,password,1,1
8,Dilan,Windross,7,dwindross7@berkeley.edu,734-877-9244,password,1,1
9,Matty,Chillistone,7,mchillistone8@biglobe.ne.jp,537-551-7167,password,1,1
10,Jayson,Blundan,6,jblundan9@bbb.org,969-697-4721,password,1,1
11,Ely,Streeten,8,estreetena@uol.com.br,696-920-7304,password,1,1
12,Rafaelia,Osgar,9,rosgarb@cbc.ca,921-320-0788,password,1,1
13,Vivianne,Pymm,10,vpymmc@statcounter.com,640-925-6590,password,1,1
14,Pen,Haney,10,phaneyd@nifty.com,257-699-2015,password,1,1
15,Boyd,Cracie,11,bcraciee@plala.or.jp,368-335-1033,password,1,1
16,Valera,Tinham,12,vtinhamf@networkadvertising.org,185-801-6163,password,1,1
17,Leelah,Sheldrick,13,lsheldrickg@biglobe.ne.jp,699-345-0990,password,1,1
18,Mariellen,Goldwater,20,mgoldwaterh@wikispaces.com,117-620-7189,password,1,1
19,Lemuel,Tongue,20,ltonguei@linkedin.com,555-813-9642,password,1,1
20,Nadya,Delph,20,ndelphj@wikia.com,616-866-0796,password,1,1
21,Abie,Spoure,50,aspoure0@miitbeian.gov.cn,995-385-9563,password,1,1
22,Dirk,Lilleyman,49,dlilleyman1@bizjournals.com,655-622-3791,password,1,1
23,Adlai,Baldcock,38,abaldcock2@reddit.com,392-773-0788,password,1,1
24,Garrick,Mollison,48,gmollison3@gov.uk,837-288-9241,password,1,1
25,Aron,Trenholme,21,atrenholme4@yelp.com,478-927-5311,password,1,1
26,Chic,Runnicles,22,crunnicles5@zimbio.com,431-322-8554,password,1,1
27,Wilmer,Noni,24,wnoni6@friendfeed.com,232-234-5172,password,1,1
28,Gladi,Brownscombe,25,gbrownscombe7@mtv.com,716-931-3633,password,1,1
29,Charil,Blackshaw,26,cblackshaw8@themeforest.net,482-522-8395,password,1,1
30,Stearn,Crannis,26,scrannis9@google.nl,315-448-8813,password,1,1
31,Jeramie,Treneman,28,jtrenemana@altervista.org,121-580-9582,password,1,1
32,Eudora,Franzettoini,28,efranzettoinib@seattletimes.com,560-501-2080,password,1,1
33,Phylys,Coneau,27,pconeauc@angelfire.com,888-657-2933,password,1,1
34,Darcey,Lartice,14,dlarticed@webmd.com,583-887-7238,password,1,1
35,Karena,Starmer,14,kstarmere@auda.org.au,331-729-7045,password,1,1
36,Cullie,Brotherick,16,cbrotherickf@addthis.com,442-324-7960,password,1,1
37,Kerrie,Dreschler,15,kdreschlerg@businesswire.com,382-906-2657,password,1,1
38,Deny,Springtorpe,17,dspringtorpeh@japanpost.jp,108-871-7631,password,1,1
39,Burk,Ainslee,18,bainsleei@gnu.org,950-309-2017,password,1,1
40,Rudolfo,Filinkov,19,rfilinkovj@toplist.cz,147-574-5725,password,1,1
41,Stanly,Gonsalvez,19,sgonsalvezk@cyberchimps.com,217-660-7124,password,1,1
42,Royce,Woodeson,23,rwoodesonl@sitemeter.com,447-237-5973,password,1,1
43,Sibyl,Romanet,23,sromanetm@usatoday.com,818-977-2897,password,1,1
44,Carilyn,Stitt,29,cstittn@google.com,794-112-5345,password,1,1
45,Rosamund,Earngy,30,rearngyo@uol.com.br,882-922-6686,password,1,1
46,Marcello,Mallabund,30,mmallabundp@princeton.edu,974-255-7740,password,1,1
47,Desmund,Merriman,33,dmerrimanq@infoseek.co.jp,700-290-3087,password,1,1
48,Hedvig,Rikel,32,hrikelr@umich.edu,225-376-6522,password,1,1
49,Zeb,Union,32,zunions@dailymotion.com,512-534-9891,password,1,1
50,Jermain,Christoforou,31,jchristoforout@netlog.com,388-655-2509,password,1,1
51,Lorry,Coalbran,34,lcoalbranu@ovh.net,480-358-9931,password,1,1
52,Angelle,Coners,35,aconersv@nsw.gov.au,134-954-8075,password,1,1
53,Sara-ann,Tapton,36,staptonw@va.gov,261-982-9819,password,1,1
54,Thoma,Niemetz,37,tniemetzx@columbia.edu,148-599-6103,password,1,1
55,Conant,Swayte,37,cswaytey@phpbb.com,874-916-3396,password,1,1
56,Ronica,Steckings,38,rsteckingsz@umich.edu,290-970-7038,password,1,1
57,Minette,Jachimczak,39,mjachimczak10@wsj.com,256-467-8743,password,1,1
58,Thorndike,Wheeliker,39,twheeliker11@eepurl.com,990-644-3187,password,1,1
59,Miguel,Faunch,40,mfaunch12@artisteer.com,535-829-6584,password,1,1
60,Sergio,Cowey,44,scowey13@npr.org,474-402-9732,password,1,1
61,Constantine,Penhale,44,cpenhale14@berkeley.edu,585-417-5708,password,1,1
62,Chery,Plenderleith,1,cplenderleith15@cnn.com,849-774-6514,password,1,1
63,Judye,Richie,2,jrichie16@storify.com,233-545-6816,password,1,1
64,Ingaborg,Gooding,43,igooding17@istockphoto.com,771-697-3426,password,1,1
65,Cherianne,Dobbinson,43,cdobbinson18@cloudflare.com,717-488-9628,password,1,1
66,Gerhardine,Friary,41,gfriary19@360.cn,197-794-5218,password,1,1
67,Kori,Eseler,42,keseler1a@geocities.com,688-399-7319,password,1,1
68,Pen,Heritege,42,pheritege1b@umn.edu,169-328-8080,password,1,1
69,Godart,Eslie,43,geslie1c@dyndns.org,459-883-2852,password,1,1
70,Trev,Hinsche,43,thinsche1d@thetimes.co.uk,280-541-5277,password,1,1
71,Vevay,Paumier,44,vpaumier1e@samsung.com,197-277-4240,password,1,1
72,Rosella,Storey,45,rstorey1f@theatlantic.com,248-881-2051,password,1,1
73,Candide,Emsley,46,cemsley1g@free.fr,101-151-1081,password,1,1
74,Isabeau,Grishanov,49,igrishanov1h@apache.org,838-240-5675,password,1,1
75,Letty,Vampouille,49,lvampouille1i@is.gd,971-914-7406,password,1,1
76,Tiff,Salan,49,tsalan1j@prnewswire.com,854-346-0985,password,1,1
77,Wilona,Ivashkin,47,wivashkin1k@berkeley.edu,917-833-2409,password,1,1
78,Ilise,Meekins,46,imeekins1l@opera.com,719-272-4821,password,1,1
79,Loralie,Greasley,38,lgreasley1m@wikia.com,975-704-6575,password,1,1
80,Ethel,Drewet,38,edrewet1n@biblegateway.com,536-259-4584,password,1,1
81,Sol,Crocken,48,scrocken1o@umn.edu,499-887-6325,password,1,1
82,Putnam,Milazzo,48,pmilazzo1p@redcross.org,435-100-1511,password,1,1
83,Allis,Viggars,2,aviggars1q@loc.gov,922-690-0580,password,1,1
84,Concordia,Heffron,2,cheffron1r@flavors.me,605-986-5111,password,1,1
85,Glynda,Dinesen,3,gdinesen1s@godaddy.com,129-161-1269,password,1,1
86,Dee,Golton,3,dgolton1t@google.pl,468-660-9670,password,1,1
87,Petronille,Helgass,4,phelgass1u@tmall.com,689-971-6596,password,1,1
88,Euphemia,Upwood,5,eupwood1v@privacy.gov.au,583-996-5377,password,1,1
89,Goldia,Herley,5,gherley1w@yellowpages.com,372-600-2679,password,1,1
90,Aleda,Buxsey,6,abuxsey1x@latimes.com,574-562-1043,password,1,1
91,Sheffy,Hayhow,7,shayhow1y@barnesandnoble.com,776-766-6049,password,1,1
92,Merrie,Pether,7,mpether1z@bbb.org,129-485-7368,password,1,1
93,Tome,Fyldes,8,tfyldes20@xing.com,576-544-4155,password,1,1
94,Cole,Reah,21,creah21@techcrunch.com,101-461-1383,password,1,1
95,Abel,Ganiford,23,aganiford22@lycos.com,762-176-9928,password,1,1
96,Justus,Gutman,50,jgutman23@posterous.com,409-201-2452,password,1,1
97,Urbain,Tallman,49,utallman24@wikispaces.com,762-912-3770,password,1,1
98,Lonni,Mawdsley,50,lmawdsley25@imgur.com,968-676-9120,password,1,1
99,Yehudit,Brownill,50,ybrownill26@constantcontact.com,829-122-8448,password,1,1
100,Gayleen,Roote,50,groote27@wp.com,268-738-8300,password,1,1
