{
"Actor": {
  "types": ["character"],
  "character": {
    "biography": "",
    "health": {
      "value": 8,
      "min": 0,
      "max": 8
    },
    "strain": {
      "value": 0,
      "min": 0,
      "max": 10
    },
    "effort": {
      "available": {
        "value": 0,
        "dtype": "Number"
	  },
      "cap": {
        "value": 0,
        "dtype": "Number"
	  },
      "temp": {
        "value": 0,
        "dtype": "Number"
	  },
      "scene": {
        "value": 0,
        "dtype": "Number"
	  },
      "day": {
        "value": 0,
        "dtype": "Number"
	  }
    },
    "Class": {},
	"AC": {},
	"Level": {},
	"EXP": {},
    "Saves": {
      "physical": {
        "value": 15,
        "label": "",
        "dtype": "Number"
      },
      "evasion": {
        "value": 15,
        "label": "",
        "dtype": "Number"
      },
      "mental": {
        "value": 15,
        "label": "",
        "dtype": "Number"
      }
    },
    "attributes": {
      "str": {
        "value": 10,
        "label": "",
        "dtype": "Number"
      },
      "dex": {
        "value": 10,
        "label": "",
        "dtype": "Number"
      },
      "con": {
        "value": 10,
        "label": "",
        "dtype": "Number"
      },
      "wis": {
        "value": 10,
        "label": "",
        "dtype": "Number"
      },
      "int": {
        "value": 10,
        "label": "",
        "dtype": "Number"
      },
      "cha": {
        "value": 10,
        "label": "",
        "dtype": "Number"
      },
      "str_mod": {
        "value": 0,
        "label": "",
        "dtype": "Number"
      },
      "dex_mod": {
        "value": 0,
        "label": "",
        "dtype": "Number"
      },
      "con_mod": {
        "value": 0,
        "label": "",
        "dtype": "Number"
      },
      "wis_mod": {
        "value": 0,
        "label": "",
        "dtype": "Number"
      },
      "int_mod": {
        "value": 0,
        "label": "",
        "dtype": "Number"
      },
      "cha_mod": {
        "value": 0,
        "label": "",
        "dtype": "Number"
	  }
    }
  }
},
"Item": {
  "types": ["item"],
  "item": {
    "description": "",
    "quantity": 1,
    "weight": 0,
    "attributes": {}
  }
}
}
