{
  "project_info": {
    "project_number": "936133512204",
    "firebase_url": "https://fcm-demo-c5c00.firebaseio.com",
    "project_id": "fcm-demo-c5c00",
    "storage_bucket": "fcm-demo-c5c00.appspot.com"
  },
  "client": [
    {
      "client_info": {
        "mobilesdk_app_id": "1:936133512204:android:aa6ab2e26865952a01b229",
        "android_client_info": {
          "package_name": "com.example.recyclerview"
        }
      },
      "oauth_client": [
        {
          "client_id": "936133512204-1m3i0shftalvk003p1d7v7gn7lsgj47v.apps.googleusercontent.com",
          "client_type": 3
        }
      ],
      "api_key": [
        {
          "current_key": "AIzaSyDj88gtXIuKiVl5q9jK5Nt6eJpVqV3jYkU"
        }
      ],
      "services": {
        "appinvite_service": {
          "other_platform_oauth_client": [
            {
              "client_id": "936133512204-1m3i0shftalvk003p1d7v7gn7lsgj47v.apps.googleusercontent.com",
              "client_type": 3
            }
          ]
        }
      }
    }
  ],
  "configuration_version": "1"
}