[
    {
        "text": "dacut wagi (web)?",
        "image": "",
        "sound": "audios/ane.m4a",
        "correctAnswer": "Aghyul",
        "options": [
            "images/chat.jpeg",
            "images/ane.jpeg",
            "images/coq.jpeg",
            "images/chien.jpeg"
        ],
        "questionType": "sound"
    },
    {
        "text": "dacut wagi (web)?",
        "image": "",
        "sound": "audios/chat.m4a",
        "correctAnswer": "Amcic",
        "options": [
            "images/ane.jpeg",
            "images/chat.jpeg",
            "images/chien.jpeg",
            "images/coq.jpeg"
        ],
        "questionType": "sound"
    },
    {
        "text": "dacut wagi (web)?",
        "image": "",
        "sound": "audios/chien.m4a",
        "correctAnswer": "Aqjun",
        "options": [
            "images/ane.jpeg",
            "images/chat.jpeg",
            "images/chien.jpeg",
            "images/coq.jpeg"
        ],
        "questionType": "sound"
    },
    {
        "text": "dacut wagi (web)?",
        "image": "",
        "sound": "audios/coq.m4a",
        "correctAnswer": "Ayazid",
        "options": [
            "images/ane.jpeg",
            "images/chat.jpeg",
            "images/chien.jpeg",
            "images/coq.jpeg"
        ],
        "questionType": "sound"
    }
]
