[
  {
    "levelName": "Animaux 1",
    "questionsFile": "json_questions/level1.json",
    "levelStyle": {
      "backgroundImage": "backgrounds/level1.png",
      "iconImage" : "levelicons/animaux1.jpeg",
      "backgroundColor": [163, 104, 161, 13],
      "optionsGradient": [
        [73, 88, 51],
        [163, 104, 161, 13],
        [184, 221, 245, 66]
      ]
    },
    "number": 1,
    "uuid": "WEBLEVEL1",
    "difficulty": 10,
    "achievementIdIOS": "first_win",
    "achievementIdAndroid": "NhkIwB69ejkMAOOLDb"
  },
  {
    "levelName": "Animaux 2",
    "questionsFile": "json_questions/level1.json",
    "levelStyle": {
      "backgroundImage": "backgrounds/level1.png",
      "iconImage" : "levelicons/animaux2.jpeg",
      "backgroundColor": [163, 104, 161, 13],
      "optionsGradient": [
        [73, 88, 51],
        [163, 104, 161, 13],
        [184, 221, 245, 66]
      ]
    },
    "number": 2,
    "uuid": "WEBLEVEL2",
    "difficulty": 10,
    "achievementIdIOS": "first_win",
    "achievementIdAndroid": "NhkIwB69ejkMAOOLDb"
  },
  {
    "levelName": "Insectes 2",
    "questionsFile": "json_questions/level1.json",
    "levelStyle": {
      "backgroundImage": "backgrounds/level1.png",
      "iconImage" : "levelicons/insectes2.jpeg",
      "backgroundColor": [163, 104, 161, 13],
      "optionsGradient": [
        [73, 88, 51],
        [163, 104, 161, 13],
        [184, 221, 245, 66]
      ]
    },
    "number": 2,
    "uuid": "WEBLEVEL2_1",
    "difficulty": 10,
    "achievementIdIOS": "first_win",
    "achievementIdAndroid": "NhkIwB69ejkMAOOLDb"
  },
  {
    "levelName": "Animaux 3",
    "questionsFile": "json_questions/level1.json",
    "levelStyle": {
      "backgroundImage": "backgrounds/level1.png",
      "iconImage" : "levelicons/animaux3.jpeg",
      "backgroundColor": [163, 104, 161, 13],
      "optionsGradient": [
        [73, 88, 51],
        [163, 104, 161, 13],
        [184, 221, 245, 66]
      ]
    },
    "number": 3,
    "uuid": "WEBLEVEL3_1",
    "difficulty": 10,
    "achievementIdIOS": "first_win",
    "achievementIdAndroid": "NhkIwB69ejkMAOOLDb"
  },
  {
    "levelName": "Insectes 3",
    "questionsFile": "json_questions/level1.json",
    "levelStyle": {
      "backgroundImage": "backgrounds/level1.png",
      "iconImage" : "levelicons/insectes3.jpeg",
      "backgroundColor": [163, 104, 161, 13],
      "optionsGradient": [
        [73, 88, 51],
        [163, 104, 161, 13],
        [184, 221, 245, 66]
      ]
    },
    "number": 3,
    "uuid": "WEBLEVEL3_2",
    "difficulty": 10,
    "achievementIdIOS": "first_win",
    "achievementIdAndroid": "NhkIwB69ejkMAOOLDb"
  },
  {
    "levelName": "Plantes 4",
    "questionsFile": "json_questions/level1.json",
    "levelStyle": {
      "backgroundImage": "backgrounds/level1.png",
      "iconImage" : "levelicons/plantes4.jpeg",
      "backgroundColor": [163, 104, 161, 13],
      "optionsGradient": [
        [73, 88, 51],
        [163, 104, 161, 13],
        [184, 221, 245, 66]
      ]
    },
    "number": 4,
    "uuid": "WEBLEVEL4",
    "difficulty": 10,
    "achievementIdIOS": "first_win",
    "achievementIdAndroid": "NhkIwB69ejkMAOOLDb"
  }
]
