[
    {
        "text": "Sillon",
        "image": "",
        "sound": "",
        "correctAnswer": "Aḍref",
        "options": [
            "Aḍref",
            "Tamtunt",
            "Aɣenja",
            "Amenzu"
        ],
        "questionType": "text"
    }
    ]