<?xml version="1.0" standalone="no"?>
<!DOCTYPE svg PUBLIC "-//W3C//DTD SVG 20010904//EN"
 "http://www.w3.org/TR/2001/REC-SVG-20010904/DTD/svg10.dtd">
<svg version="1.0" xmlns="http://www.w3.org/2000/svg"
 width="250.000000pt" height="250.000000pt" viewBox="0 0 250.000000 250.000000"
 preserveAspectRatio="xMidYMid meet">
<metadata>
Created by potrace 1.14, written by Peter Selinger 2001-2017
</metadata>
<g transform="translate(0.000000,250.000000) scale(0.100000,-0.100000)"
fill="#000000" stroke="none">
<path d="M593 1940 c-155 -33 -258 -142 -283 -300 -13 -84 -13 -686 0 -770 21
-133 100 -236 216 -280 86 -34 253 -34 338 0 82 32 165 114 197 195 24 60 24
62 24 470 l0 410 -24 60 c-33 83 -116 164 -196 194 -67 25 -203 36 -272 21z
m182 -151 c54 -15 120 -82 134 -137 8 -29 11 -159 9 -420 l-3 -377 -25 -43
c-32 -57 -92 -92 -167 -99 -77 -7 -136 10 -184 54 -65 59 -69 85 -69 485 0
222 4 365 11 393 30 118 159 181 294 144z"/>
<path d="M1420 1255 l0 -675 85 0 85 0 0 310 0 310 215 0 215 0 0 -310 0 -310
85 0 85 0 0 675 0 675 -85 0 -85 0 0 -290 0 -290 -215 0 -215 0 0 290 0 290
-85 0 -85 0 0 -675z"/>
</g>
</svg>
