{
    "docs": {
        "Getting started": ["getting-started"],
        "Guides": ["guides/creating-project", "guides/navigation", "guides/editing", "guides/control-data"],
        "Examples": ["examples/creating-project"]
    }
}
