%YAML 1.1
%TAG !u! tag:unity3d.com,2011:
--- !u!114 &-2837833380018638521
MonoBehaviour:
  m_ObjectHideFlags: 0
  m_CorrespondingSourceObject: {fileID: 0}
  m_PrefabInstance: {fileID: 0}
  m_PrefabAsset: {fileID: 0}
  m_GameObject: {fileID: 0}
  m_Enabled: 1
  m_EditorHideFlags: 0
  m_Script: {fileID: 11500000, guid: 775ad4994fda946d1a5936c7e2dfc785, type: 3}
  m_Name: fixed
  m_EditorClassIdentifier: 
  particleIndices: 00000000
  m_Blueprint: {fileID: 11400000}
--- !u!114 &11400000
MonoBehaviour:
  m_ObjectHideFlags: 0
  m_CorrespondingSourceObject: {fileID: 0}
  m_PrefabInstance: {fileID: 0}
  m_PrefabAsset: {fileID: 0}
  m_GameObject: {fileID: 0}
  m_Enabled: 1
  m_EditorHideFlags: 0
  m_Script: {fileID: 11500000, guid: 8f7e67b5626124d0db9886e6cd2aacff, type: 3}
  m_Name: elastico
  m_EditorClassIdentifier: 
  m_Empty: 0
  m_ActiveParticleCount: 33
  m_InitialActiveParticleCount: 33
  _bounds:
    m_Center: {x: 0.31467956, y: 0.04234167, z: -0.000000039407883}
    m_Extent: {x: 0.31467956, y: 0.0423417, z: 0.000000039407883}
  positions:
  - {x: 0.001033904, y: -0.000000034601175, z: -0.000000078815766}
  - {x: 0.02108361, y: 0.00018295059, z: -0.000000078645456}
  - {x: 0.040830992, y: 0.0007259255, z: -0.000000078140104}
  - {x: 0.06071552, y: 0.0016425523, z: -0.00000007728699}
  - {x: 0.08053749, y: 0.0029295012, z: -0.000000076089215}
  - {x: 0.10021514, y: 0.0045765345, z: -0.0000000745563}
  - {x: 0.12007079, y: 0.0066089625, z: -0.000000072664704}
  - {x: 0.13974665, y: 0.008983381, z: -0.0000000704548}
  - {x: 0.15937576, y: 0.011698198, z: -0.0000000679281}
  - {x: 0.17904857, y: 0.014749066, z: -0.000000065088614}
  - {x: 0.1985953, y: 0.01808519, z: -0.000000061983656}
  - {x: 0.21808478, y: 0.021685863, z: -0.00000005863247}
  - {x: 0.2376017, y: 0.025531908, z: -0.000000055052915}
  - {x: 0.25703493, y: 0.029560696, z: -0.00000005130327}
  - {x: 0.27642485, y: 0.033734072, z: -0.000000047419057}
  - {x: 0.29582378, y: 0.03801421, z: -0.00000004343549}
  - {x: 0.3151965, y: 0.042341664, z: -0.000000039407883}
  - {x: 0.33456925, y: 0.04666912, z: -0.000000035380275}
  - {x: 0.35396814, y: 0.050949253, z: -0.00000003139671}
  - {x: 0.3733581, y: 0.055122636, z: -0.000000027512495}
  - {x: 0.39279136, y: 0.05915143, z: -0.000000023762853}
  - {x: 0.41230828, y: 0.062997475, z: -0.000000020183299}
  - {x: 0.43179777, y: 0.06659815, z: -0.000000016832113}
  - {x: 0.45134443, y: 0.069934264, z: -0.000000013727152}
  - {x: 0.47101724, y: 0.07298513, z: -0.000000010887676}
  - {x: 0.49064636, y: 0.07569995, z: -0.000000008360964}
  - {x: 0.5103222, y: 0.078074366, z: -0.0000000061510677}
  - {x: 0.53017783, y: 0.080106795, z: -0.000000004259467}
  - {x: 0.5498555, y: 0.08175383, z: -0.0000000027265545}
  - {x: 0.5696775, y: 0.08304078, z: -0.0000000015287741}
  - {x: 0.58956206, y: 0.083957404, z: -6.7565903e-10}
  - {x: 0.60930943, y: 0.08450038, z: -1.7030653e-10}
  - {x: 0.6293591, y: 0.084683366, z: 0}
  - {x: 0, y: 0, z: 0}
  - {x: 0, y: 0, z: 0}
  - {x: 0, y: 0, z: 0}
  - {x: 0, y: 0, z: 0}
  - {x: 0, y: 0, z: 0}
  - {x: 0, y: 0, z: 0}
  - {x: 0, y: 0, z: 0}
  - {x: 0, y: 0, z: 0}
  - {x: 0, y: 0, z: 0}
  - {x: 0, y: 0, z: 0}
  restPositions:
  - {x: 0.001033904, y: -0.000000034601175, z: -0.000000078815766, w: 1}
  - {x: 0.02108361, y: 0.00018295059, z: -0.000000078645456, w: 1}
  - {x: 0.040830992, y: 0.0007259255, z: -0.000000078140104, w: 1}
  - {x: 0.06071552, y: 0.0016425523, z: -0.00000007728699, w: 1}
  - {x: 0.08053749, y: 0.0029295012, z: -0.000000076089215, w: 1}
  - {x: 0.10021514, y: 0.0045765345, z: -0.0000000745563, w: 1}
  - {x: 0.12007079, y: 0.0066089625, z: -0.000000072664704, w: 1}
  - {x: 0.13974665, y: 0.008983381, z: -0.0000000704548, w: 1}
  - {x: 0.15937576, y: 0.011698198, z: -0.0000000679281, w: 1}
  - {x: 0.17904857, y: 0.014749066, z: -0.000000065088614, w: 1}
  - {x: 0.1985953, y: 0.01808519, z: -0.000000061983656, w: 1}
  - {x: 0.21808478, y: 0.021685863, z: -0.00000005863247, w: 1}
  - {x: 0.2376017, y: 0.025531908, z: -0.000000055052915, w: 1}
  - {x: 0.25703493, y: 0.029560696, z: -0.00000005130327, w: 1}
  - {x: 0.27642485, y: 0.033734072, z: -0.000000047419057, w: 1}
  - {x: 0.29582378, y: 0.03801421, z: -0.00000004343549, w: 1}
  - {x: 0.3151965, y: 0.042341664, z: -0.000000039407883, w: 1}
  - {x: 0.33456925, y: 0.04666912, z: -0.000000035380275, w: 1}
  - {x: 0.35396814, y: 0.050949253, z: -0.00000003139671, w: 1}
  - {x: 0.3733581, y: 0.055122636, z: -0.000000027512495, w: 1}
  - {x: 0.39279136, y: 0.05915143, z: -0.000000023762853, w: 1}
  - {x: 0.41230828, y: 0.062997475, z: -0.000000020183299, w: 1}
  - {x: 0.43179777, y: 0.06659815, z: -0.000000016832113, w: 1}
  - {x: 0.45134443, y: 0.069934264, z: -0.000000013727152, w: 1}
  - {x: 0.47101724, y: 0.07298513, z: -0.000000010887676, w: 1}
  - {x: 0.49064636, y: 0.07569995, z: -0.000000008360964, w: 1}
  - {x: 0.5103222, y: 0.078074366, z: -0.0000000061510677, w: 1}
  - {x: 0.53017783, y: 0.080106795, z: -0.000000004259467, w: 1}
  - {x: 0.5498555, y: 0.08175383, z: -0.0000000027265545, w: 1}
  - {x: 0.5696775, y: 0.08304078, z: -0.0000000015287741, w: 1}
  - {x: 0.58956206, y: 0.083957404, z: -6.7565903e-10, w: 1}
  - {x: 0.60930943, y: 0.08450038, z: -1.7030653e-10, w: 1}
  - {x: 0.6293591, y: 0.084683366, z: 0, w: 1}
  - {x: 0, y: 0, z: 0, w: 0}
  - {x: 0, y: 0, z: 0, w: 0}
  - {x: 0, y: 0, z: 0, w: 0}
  - {x: 0, y: 0, z: 0, w: 0}
  - {x: 0, y: 0, z: 0, w: 0}
  - {x: 0, y: 0, z: 0, w: 0}
  - {x: 0, y: 0, z: 0, w: 0}
  - {x: 0, y: 0, z: 0, w: 0}
  - {x: 0, y: 0, z: 0, w: 0}
  - {x: 0, y: 0, z: 0, w: 0}
  orientations: []
  restOrientations: []
  velocities:
  - {x: 0, y: 0, z: 0}
  - {x: 0, y: 0, z: 0}
  - {x: 0, y: 0, z: 0}
  - {x: 0, y: 0, z: 0}
  - {x: 0, y: 0, z: 0}
  - {x: 0, y: 0, z: 0}
  - {x: 0, y: 0, z: 0}
  - {x: 0, y: 0, z: 0}
  - {x: 0, y: 0, z: 0}
  - {x: 0, y: 0, z: 0}
  - {x: 0, y: 0, z: 0}
  - {x: 0, y: 0, z: 0}
  - {x: 0, y: 0, z: 0}
  - {x: 0, y: 0, z: 0}
  - {x: 0, y: 0, z: 0}
  - {x: 0, y: 0, z: 0}
  - {x: 0, y: 0, z: 0}
  - {x: 0, y: 0, z: 0}
  - {x: 0, y: 0, z: 0}
  - {x: 0, y: 0, z: 0}
  - {x: 0, y: 0, z: 0}
  - {x: 0, y: 0, z: 0}
  - {x: 0, y: 0, z: 0}
  - {x: 0, y: 0, z: 0}
  - {x: 0, y: 0, z: 0}
  - {x: 0, y: 0, z: 0}
  - {x: 0, y: 0, z: 0}
  - {x: 0, y: 0, z: 0}
  - {x: 0, y: 0, z: 0}
  - {x: 0, y: 0, z: 0}
  - {x: 0, y: 0, z: 0}
  - {x: 0, y: 0, z: 0}
  - {x: 0, y: 0, z: 0}
  - {x: 0, y: 0, z: 0}
  - {x: 0, y: 0, z: 0}
  - {x: 0, y: 0, z: 0}
  - {x: 0, y: 0, z: 0}
  - {x: 0, y: 0, z: 0}
  - {x: 0, y: 0, z: 0}
  - {x: 0, y: 0, z: 0}
  - {x: 0, y: 0, z: 0}
  - {x: 0, y: 0, z: 0}
  - {x: 0, y: 0, z: 0}
  angularVelocities: []
  invMasses:
  - 0.99999976
  - 10.000001
  - 10
  - 10.000001
  - 10.000001
  - 10.000001
  - 9.999999
  - 10.000001
  - 9.999999
  - 10.000001
  - 9.999999
  - 9.999999
  - 9.999999
  - 10
  - 10.000001
  - 10
  - 10
  - 10
  - 10
  - 10
  - 10
  - 10
  - 10
  - 10
  - 10
  - 10
  - 10
  - 10
  - 10
  - 10
  - 10
  - 10
  - 10
  - 0
  - 0
  - 0
  - 0
  - 0
  - 0
  - 0
  - 0
  - 0
  - 0
  invRotationalMasses: []
  phases: 01000000010000000100000001000000010000000100000001000000010000000100000001000000010000000100000001000000010000000100000001000000010000000100000001000000010000000100000001000000010000000100000001000000010000000100000001000000010000000100000001000000010000000100000000000000000000000000000000000000000000000000000000000000000000000000000000000000
  principalRadii:
  - {x: 0.010000003, y: 0.010000003, z: 0.010000003}
  - {x: 0.010000003, y: 0.010000003, z: 0.010000003}
  - {x: 0.010000003, y: 0.010000003, z: 0.010000003}
  - {x: 0.010000003, y: 0.010000003, z: 0.010000003}
  - {x: 0.010000003, y: 0.010000003, z: 0.010000003}
  - {x: 0.010000003, y: 0.010000003, z: 0.010000003}
  - {x: 0.0100000035, y: 0.0100000035, z: 0.0100000035}
  - {x: 0.010000003, y: 0.010000003, z: 0.010000003}
  - {x: 0.010000003, y: 0.010000003, z: 0.010000003}
  - {x: 0.010000001, y: 0.010000001, z: 0.010000001}
  - {x: 0.0100000035, y: 0.0100000035, z: 0.0100000035}
  - {x: 0.0100000035, y: 0.0100000035, z: 0.0100000035}
  - {x: 0.0100000035, y: 0.0100000035, z: 0.0100000035}
  - {x: 0.010000003, y: 0.010000003, z: 0.010000003}
  - {x: 0.010000001, y: 0.010000001, z: 0.010000001}
  - {x: 0.010000003, y: 0.010000003, z: 0.010000003}
  - {x: 0.010000003, y: 0.010000003, z: 0.010000003}
  - {x: 0.010000003, y: 0.010000003, z: 0.010000003}
  - {x: 0.010000003, y: 0.010000003, z: 0.010000003}
  - {x: 0.010000003, y: 0.010000003, z: 0.010000003}
  - {x: 0.010000003, y: 0.010000003, z: 0.010000003}
  - {x: 0.010000003, y: 0.010000003, z: 0.010000003}
  - {x: 0.010000003, y: 0.010000003, z: 0.010000003}
  - {x: 0.010000003, y: 0.010000003, z: 0.010000003}
  - {x: 0.010000003, y: 0.010000003, z: 0.010000003}
  - {x: 0.010000003, y: 0.010000003, z: 0.010000003}
  - {x: 0.010000003, y: 0.010000003, z: 0.010000003}
  - {x: 0.010000003, y: 0.010000003, z: 0.010000003}
  - {x: 0.010000003, y: 0.010000003, z: 0.010000003}
  - {x: 0.010000003, y: 0.010000003, z: 0.010000003}
  - {x: 0.010000003, y: 0.010000003, z: 0.010000003}
  - {x: 0.010000003, y: 0.010000003, z: 0.010000003}
  - {x: 0.010000003, y: 0.010000003, z: 0.010000003}
  - {x: 0, y: 0, z: 0}
  - {x: 0, y: 0, z: 0}
  - {x: 0, y: 0, z: 0}
  - {x: 0, y: 0, z: 0}
  - {x: 0, y: 0, z: 0}
  - {x: 0, y: 0, z: 0}
  - {x: 0, y: 0, z: 0}
  - {x: 0, y: 0, z: 0}
  - {x: 0, y: 0, z: 0}
  - {x: 0, y: 0, z: 0}
  colors:
  - {r: 1, g: 0, b: 0, a: 1}
  - {r: 0.99999994, g: 0.0021608155, b: 0.0021608155, a: 0.99999994}
  - {r: 1, g: 0.008572638, b: 0.008572638, a: 1}
  - {r: 0.99999994, g: 0.019396799, b: 0.019396799, a: 0.99999994}
  - {r: 0.99999994, g: 0.034593977, b: 0.034593977, a: 0.99999994}
  - {r: 0.99999994, g: 0.054043286, b: 0.054043286, a: 0.99999994}
  - {r: 1.0000001, g: 0.0780436, b: 0.0780436, a: 1.0000001}
  - {r: 0.99999994, g: 0.106082365, b: 0.106082365, a: 0.99999994}
  - {r: 1, g: 0.1381408, b: 0.1381408, a: 1}
  - {r: 0.99999994, g: 0.17416754, b: 0.17416754, a: 0.99999994}
  - {r: 1.0000001, g: 0.2135628, b: 0.2135628, a: 1.0000001}
  - {r: 1.0000001, g: 0.25608203, b: 0.25608203, a: 1.0000001}
  - {r: 1.0000001, g: 0.30149877, b: 0.30149877, a: 1.0000001}
  - {r: 1, g: 0.3490735, b: 0.3490735, a: 1}
  - {r: 0.99999994, g: 0.3983556, b: 0.3983556, a: 0.99999994}
  - {r: 1, g: 0.44889843, b: 0.44889843, a: 1}
  - {r: 1, g: 0.5, b: 0.5, a: 1}
  - {r: 1, g: 0.55110157, b: 0.55110157, a: 1}
  - {r: 1, g: 0.60164434, b: 0.60164434, a: 1}
  - {r: 1, g: 0.65092653, b: 0.65092653, a: 1}
  - {r: 1, g: 0.6985013, b: 0.6985013, a: 1}
  - {r: 1, g: 0.743918, b: 0.743918, a: 1}
  - {r: 1, g: 0.7864373, b: 0.7864373, a: 1}
  - {r: 1, g: 0.8258324, b: 0.8258324, a: 1}
  - {r: 1, g: 0.86185914, b: 0.86185914, a: 1}
  - {r: 1, g: 0.8939176, b: 0.8939176, a: 1}
  - {r: 1, g: 0.92195636, b: 0.92195636, a: 1}
  - {r: 1, g: 0.94595665, b: 0.94595665, a: 1}
  - {r: 1, g: 0.965406, b: 0.965406, a: 1}
  - {r: 1, g: 0.9806032, b: 0.9806032, a: 1}
  - {r: 1, g: 0.99142736, b: 0.99142736, a: 1}
  - {r: 1, g: 0.99783915, b: 0.99783915, a: 1}
  - {r: 1, g: 1, b: 1, a: 1}
  - {r: 0, g: 0, b: 0, a: 0}
  - {r: 0, g: 0, b: 0, a: 0}
  - {r: 0, g: 0, b: 0, a: 0}
  - {r: 0, g: 0, b: 0, a: 0}
  - {r: 0, g: 0, b: 0, a: 0}
  - {r: 0, g: 0, b: 0, a: 0}
  - {r: 0, g: 0, b: 0, a: 0}
  - {r: 0, g: 0, b: 0, a: 0}
  - {r: 0, g: 0, b: 0, a: 0}
  - {r: 0, g: 0, b: 0, a: 0}
  distanceConstraintsData:
    batches:
    - m_IDs: 000000000100000002000000030000000400000005000000060000000700000008000000090000000a0000000b0000000c0000000d0000000e0000000f0000001000000011000000120000001300000014000000
      m_IDToIndex: 000000000100000002000000030000000400000005000000060000000700000008000000090000000a0000000b0000000c0000000d0000000e0000000f0000001000000011000000120000001300000014000000
      m_ConstraintCount: 21
      m_ActiveConstraintCount: 16
      m_InitialActiveConstraintCount: 16
      particleIndices:
        serializedContents: 000000000100000002000000030000000400000005000000060000000700000008000000090000000a0000000b0000000c0000000d0000000e0000000f000000100000001100000012000000130000001400000015000000160000001700000018000000190000001a0000001b0000001c0000001d0000001e0000001f00000000000000000000000000000000000000000000000000000000000000000000000000000000000000
      restLengths:
        serializedContents:
        - 0.02005054
        - 0.019905644
        - 0.019746454
        - 0.01981861
        - 0.01990797
        - 0.019819302
        - 0.01984645
        - 0.019865498
        - 0.01985018
        - 0.019834
        - 0.01989226
        - 0.019829309
        - 0.019815968
        - 0.019959368
        - 0.019863736
        - 0.01975484
        - 0
        - 0
        - 0
        - 0
        - 0
      stiffnesses:
        serializedContents:
        - {x: 0, y: 0}
        - {x: 0, y: 0}
        - {x: 0, y: 0}
        - {x: 0, y: 0}
        - {x: 0, y: 0}
        - {x: 0, y: 0}
        - {x: 0, y: 0}
        - {x: 0, y: 0}
        - {x: 0, y: 0}
        - {x: 0, y: 0}
        - {x: 0, y: 0}
        - {x: 0, y: 0}
        - {x: 0, y: 0}
        - {x: 0, y: 0}
        - {x: 0, y: 0}
        - {x: 0, y: 0}
        - {x: 0, y: 0}
        - {x: 0, y: 0}
        - {x: 0, y: 0}
        - {x: 0, y: 0}
        - {x: 0, y: 0}
    - m_IDs: 000000000100000002000000030000000400000005000000060000000700000008000000090000000a0000000b0000000c0000000d0000000e0000000f0000001000000011000000120000001300000014000000
      m_IDToIndex: 000000000100000002000000030000000400000005000000060000000700000008000000090000000a0000000b0000000c0000000d0000000e0000000f0000001000000011000000120000001300000014000000
      m_ConstraintCount: 21
      m_ActiveConstraintCount: 16
      m_InitialActiveConstraintCount: 16
      particleIndices:
        serializedContents: 0100000002000000030000000400000005000000060000000700000008000000090000000a0000000b0000000c0000000d0000000e0000000f000000100000001100000012000000130000001400000015000000160000001700000018000000190000001a0000001b0000001c0000001d0000001e0000001f0000002000000000000000000000000000000000000000000000000000000000000000000000000000000000000000
      restLengths:
        serializedContents:
        - 0.019754846
        - 0.019863706
        - 0.019959405
        - 0.019815953
        - 0.019829383
        - 0.01989226
        - 0.019833969
        - 0.019850178
        - 0.019865466
        - 0.01984648
        - 0.019819317
        - 0.01990797
        - 0.019818602
        - 0.019746447
        - 0.019905701
        - 0.020050526
        - 0
        - 0
        - 0
        - 0
        - 0
      stiffnesses:
        serializedContents:
        - {x: 0, y: 0}
        - {x: 0, y: 0}
        - {x: 0, y: 0}
        - {x: 0, y: 0}
        - {x: 0, y: 0}
        - {x: 0, y: 0}
        - {x: 0, y: 0}
        - {x: 0, y: 0}
        - {x: 0, y: 0}
        - {x: 0, y: 0}
        - {x: 0, y: 0}
        - {x: 0, y: 0}
        - {x: 0, y: 0}
        - {x: 0, y: 0}
        - {x: 0, y: 0}
        - {x: 0, y: 0}
        - {x: 0, y: 0}
        - {x: 0, y: 0}
        - {x: 0, y: 0}
        - {x: 0, y: 0}
        - {x: 0, y: 0}
  bendConstraintsData:
    batches:
    - m_IDs: 000000000100000002000000030000000400000005000000060000000700000008000000090000000a0000000b0000000c0000000d000000
      m_IDToIndex: 000000000100000002000000030000000400000005000000060000000700000008000000090000000a0000000b0000000c0000000d000000
      m_ConstraintCount: 14
      m_ActiveConstraintCount: 11
      m_InitialActiveConstraintCount: 11
      particleIndices:
        serializedContents: 000000000200000001000000030000000500000004000000060000000800000007000000090000000b0000000a0000000c0000000e0000000d0000000f0000001100000010000000120000001400000013000000150000001700000016000000180000001a000000190000001b0000001d0000001c0000001e000000200000001f000000210000002300000022000000240000002600000025000000270000002900000028000000
      restBends:
        serializedContents:
        - 0
        - 0
        - 0
        - 0
        - 0
        - 0
        - 0
        - 0
        - 0
        - 0
        - 0
        - 0
        - 0
        - 0
      bendingStiffnesses:
        serializedContents:
        - {x: 0, y: 0}
        - {x: 0, y: 0}
        - {x: 0, y: 0}
        - {x: 0, y: 0}
        - {x: 0, y: 0}
        - {x: 0, y: 0}
        - {x: 0, y: 0}
        - {x: 0, y: 0}
        - {x: 0, y: 0}
        - {x: 0, y: 0}
        - {x: 0, y: 0}
        - {x: 0, y: 0}
        - {x: 0, y: 0}
        - {x: 0, y: 0}
    - m_IDs: 000000000100000002000000030000000400000005000000060000000700000008000000090000000a0000000b0000000c0000000d000000
      m_IDToIndex: 000000000100000002000000030000000400000005000000060000000700000008000000090000000a0000000b0000000c0000000d000000
      m_ConstraintCount: 14
      m_ActiveConstraintCount: 10
      m_InitialActiveConstraintCount: 10
      particleIndices:
        serializedContents: 0100000003000000020000000400000006000000050000000700000009000000080000000a0000000c0000000b0000000d0000000f0000000e000000100000001200000011000000130000001500000014000000160000001800000017000000190000001b0000001a0000001c0000001e0000001d0000001f0000002100000020000000220000002400000023000000250000002700000026000000280000002a00000029000000
      restBends:
        serializedContents:
        - 0
        - 0
        - 0
        - 0
        - 0
        - 0
        - 0
        - 0
        - 0
        - 0
        - 0
        - 0
        - 0
        - 0
      bendingStiffnesses:
        serializedContents:
        - {x: 0, y: 0}
        - {x: 0, y: 0}
        - {x: 0, y: 0}
        - {x: 0, y: 0}
        - {x: 0, y: 0}
        - {x: 0, y: 0}
        - {x: 0, y: 0}
        - {x: 0, y: 0}
        - {x: 0, y: 0}
        - {x: 0, y: 0}
        - {x: 0, y: 0}
        - {x: 0, y: 0}
        - {x: 0, y: 0}
        - {x: 0, y: 0}
    - m_IDs: 000000000100000002000000030000000400000005000000060000000700000008000000090000000a0000000b0000000c000000
      m_IDToIndex: 000000000100000002000000030000000400000005000000060000000700000008000000090000000a0000000b0000000c000000
      m_ConstraintCount: 13
      m_ActiveConstraintCount: 10
      m_InitialActiveConstraintCount: 10
      particleIndices:
        serializedContents: 020000000400000003000000050000000700000006000000080000000a000000090000000b0000000d0000000c0000000e000000100000000f0000001100000013000000120000001400000016000000150000001700000019000000180000001a0000001c0000001b0000001d0000001f0000001e000000200000002200000021000000230000002500000024000000260000002800000027000000
      restBends:
        serializedContents:
        - 0
        - 0
        - 0
        - 0
        - 0
        - 0
        - 0
        - 0
        - 0
        - 0
        - 0
        - 0
        - 0
      bendingStiffnesses:
        serializedContents:
        - {x: 0, y: 0}
        - {x: 0, y: 0}
        - {x: 0, y: 0}
        - {x: 0, y: 0}
        - {x: 0, y: 0}
        - {x: 0, y: 0}
        - {x: 0, y: 0}
        - {x: 0, y: 0}
        - {x: 0, y: 0}
        - {x: 0, y: 0}
        - {x: 0, y: 0}
        - {x: 0, y: 0}
        - {x: 0, y: 0}
  pinConstraintsData:
    batches:
    - m_IDs: 
      m_IDToIndex: 
      m_ConstraintCount: 0
      m_ActiveConstraintCount: 0
      m_InitialActiveConstraintCount: 0
      particleIndices:
        serializedContents: 
      offsets:
        serializedContents: []
      restDarbouxVectors:
        serializedContents: []
      stiffnesses:
        serializedContents: []
      breakThresholds:
        serializedContents: []
      constraintForces: []
  skinConstraintsData:
    batches: []
  tetherConstraintsData:
    batches: []
  stretchShearConstraintsData:
    batches: []
  bendTwistConstraintsData:
    batches: []
  shapeMatchingConstraintsData:
    batches: []
  aerodynamicConstraintsData:
    batches: []
  chainConstraintsData:
    batches: []
  volumeConstraintsData:
    batches: []
  groups:
  - {fileID: -2837833380018638521}
  - {fileID: 2887079040975583114}
  path:
    m_Names:
    - fixed
    - control point
    m_Points:
      data:
      - tangentMode: 0
        inTangent: {x: -0.25, y: 0, z: 0}
        position: {x: 0.001033904, y: -0.000000034601175, z: -0.000000078815766}
        outTangent: {x: 0.25, y: 0, z: 0}
      - tangentMode: 0
        inTangent: {x: -0.25, y: 0, z: 0}
        position: {x: 0.6293591, y: 0.084683366, z: 0}
        outTangent: {x: 0.25, y: 0, z: 0}
    m_Normals:
      data:
      - {x: 0, y: 1, z: 0}
      - {x: 0, y: 1, z: 0}
    m_Colors:
      data:
      - {r: 1, g: 0, b: 0, a: 1}
      - {r: 1, g: 1, b: 1, a: 1}
    m_Thickness:
      data:
      - 1.0000002
      - 1.0000002
    m_Masses:
      data:
      - 0.1
      - 0.1
    m_RotationalMasses:
      data:
      - 1
      - 1
    m_Phases:
      data: 0100000001000000
    m_Closed: 0
    m_ArcLengthTable:
    - 0
    - 0.034918804
    - 0.068373546
    - 0.10054958
    - 0.13162485
    - 0.16176929
    - 0.1911445
    - 0.21990387
    - 0.24819325
    - 0.27615198
    - 0.3039144
    - 0.33161175
    - 0.35937417
    - 0.3873329
    - 0.41562226
    - 0.44438165
    - 0.47375685
    - 0.5039013
    - 0.5349766
    - 0.5671526
    - 0.60060734
    - 0.6355261
    m_TotalSplineLenght: 0.6355261
    OnPathChanged:
      m_PersistentCalls:
        m_Calls: []
    OnControlPointAdded:
      m_PersistentCalls:
        m_Calls: []
    OnControlPointRemoved:
      m_PersistentCalls:
        m_Calls: []
    OnControlPointRenamed:
      m_PersistentCalls:
        m_Calls: []
  thickness: 0.01
  resolution: 0.5
  m_InterParticleDistance: 0.019860191
  totalParticles: 43
  m_RestLength: 0.83412236
  restLengths:
  - 0.02005054
  - 0.019754846
  - 0.019905644
  - 0.019863706
  - 0.019746454
  - 0.019959405
  - 0.01981861
  - 0.019815953
  - 0.01990797
  - 0.019829383
  - 0.019819302
  - 0.01989226
  - 0.01984645
  - 0.019833969
  - 0.019865498
  - 0.019850178
  - 0.01985018
  - 0.019865466
  - 0.019834
  - 0.01984648
  - 0.01989226
  - 0.019819317
  - 0.019829309
  - 0.01990797
  - 0.019815968
  - 0.019818602
  - 0.019959368
  - 0.019746447
  - 0.019863736
  - 0.019905701
  - 0.01975484
  - 0.020050526
  - 0.019860191
  - 0.019860191
  - 0.019860191
  - 0.019860191
  - 0.019860191
  - 0.019860191
  - 0.019860191
  - 0.019860191
  - 0.019860191
  - 0.019860191
  - 0
  pooledParticles: 10
--- !u!114 &2887079040975583114
MonoBehaviour:
  m_ObjectHideFlags: 0
  m_CorrespondingSourceObject: {fileID: 0}
  m_PrefabInstance: {fileID: 0}
  m_PrefabAsset: {fileID: 0}
  m_GameObject: {fileID: 0}
  m_Enabled: 1
  m_EditorHideFlags: 0
  m_Script: {fileID: 11500000, guid: 775ad4994fda946d1a5936c7e2dfc785, type: 3}
  m_Name: control point
  m_EditorClassIdentifier: 
  particleIndices: 20000000
  m_Blueprint: {fileID: 11400000}
