{"SourceModuleName":"in","SourceModuleType":"im_file","SyslogFacilityValue":1,"SyslogFacility":"USER","SyslogSeverityValue":6,"SyslogSeverity":"INFO","SeverityValue":2,"Severity":"INFO","Hostname":"mainhost","EventTime":"2016-12-27 18:40:26","SourceName":"kernel","Message":"EXT4-fs (sda1): mounted filesystem with ordered data mode. Opts: (null)","Counter":0,"ChecksumSHA1":"91dd7a49d3cbc60f5b256bd1c12189d4f586736a"}
{"SourceModuleName":"in","SourceModuleType":"im_file","SyslogFacilityValue":4,"SyslogFacility":"AUTH","SyslogSeverityValue":6,"SyslogSeverity":"INFO","SeverityValue":2,"Severity":"INFO","Hostname":"mainhost","EventTime":"2017-01-10 18:40:27","SourceName":"sshd","ProcessID":"547","Message":"Server listening on 0.0.0.0 port 22.","Counter":1,"ChecksumSHA1":"0280be7b15b0d892513588df286d1473b7b15c5a"}
{"SourceModuleName":"in","SourceModuleType":"im_file","SyslogFacilityValue":4,"SyslogFacility":"AUTH","SyslogSeverityValue":6,"SyslogSeverity":"INFO","SeverityValue":2,"Severity":"INFO","Hostname":"mainhost","EventTime":"2017-01-10 18:40:27","SourceName":"sshd","ProcessID":"547","Message":"Server listening on :: port 22.","Counter":2,"ChecksumSHA1":"0280be7b15b0d892513588df286d1473b7b15c5a"}
{"SourceModuleName":"in","SourceModuleType":"im_file","SyslogFacilityValue":3,"SyslogFacility":"DAEMON","SyslogSeverityValue":5,"SyslogSeverity":"NOTICE","SeverityValue":2,"Severity":"INFO","Hostname":"mainhost","EventTime":"2017-01-10 18:40:27","SourceName":"ntpd","ProcessID":"523","Message":"ntpd 4.2.8p10@1.3728-o Sat Sep 23 19:02:38 UTC 2017 (1): Starting","Counter":3,"ChecksumSHA1":"0280be7b15b0d892513588df286d1473b7b15c5a"}
{"SourceModuleName":"in","SourceModuleType":"im_file","SyslogFacilityValue":3,"SyslogFacility":"DAEMON","SyslogSeverityValue":3,"SyslogSeverity":"ERR","SeverityValue":4,"Severity":"ERROR","Hostname":"mainhost","EventTime":"2017-01-10 18:40:27","SourceName":"ntpd","ProcessID":"539","Message":"bind(21) AF_INET6 fe80::5054:ff:fef5:eff9%2#123 flags 0x11 failed: Cannot assign requested address","Counter":4,"ChecksumSHA1":"0280be7b15b0d892513588df286d1473b7b15c5a"}
{"SourceModuleName":"in","SourceModuleType":"im_file","SyslogFacilityValue":3,"SyslogFacility":"DAEMON","SyslogSeverityValue":3,"SyslogSeverity":"ERR","SeverityValue":4,"Severity":"ERROR","Hostname":"mainhost","EventTime":"2017-01-10 18:40:27","SourceName":"ntpd","ProcessID":"539","Message":"unable to create socket on eth0 (5) for fe80::5054:ff:fef5:eff9%2#123","Counter":5,"ChecksumSHA1":"0280be7b15b0d892513588df286d1473b7b15c5a"}
{"SourceModuleName":"in","SourceModuleType":"im_file","SyslogFacilityValue":10,"SyslogFacility":"AUTHPRIV","SyslogSeverityValue":6,"SyslogSeverity":"INFO","SeverityValue":2,"Severity":"INFO","Hostname":"devel-server","EventTime":"2017-01-10 19:17:01","SourceName":"CRON","ProcessID":"1936","Message":"pam_unix(cron:session): session opened for user root by (uid=0)","Counter":6,"ChecksumSHA1":"0280be7b15b0d892513588df286d1473b7b15c5a"}
{"SourceModuleName":"in","SourceModuleType":"im_file","SyslogFacilityValue":9,"SyslogFacility":"CRON","SyslogSeverityValue":6,"SyslogSeverity":"INFO","SeverityValue":2,"Severity":"INFO","Hostname":"devel-server","EventTime":"2017-01-10 19:17:01","SourceName":"CRON","ProcessID":"1937","Message":"(root) CMD (   cd / && run-parts --report /etc/cron.hourly)","Counter":7,"ChecksumSHA1":"0280be7b15b0d892513588df286d1473b7b15c5a"}
{"SourceModuleName":"in","SourceModuleType":"im_file","SyslogFacilityValue":10,"SyslogFacility":"AUTHPRIV","SyslogSeverityValue":6,"SyslogSeverity":"INFO","SeverityValue":2,"Severity":"INFO","Hostname":"devel-server","EventTime":"2017-01-10 19:17:01","SourceName":"CRON","ProcessID":"1936","Message":"pam_unix(cron:session): session closed for user root","Counter":8,"ChecksumSHA1":"0280be7b15b0d892513588df286d1473b7b15c5a"}
{"SourceModuleName":"in","SourceModuleType":"im_file","SyslogFacilityValue":4,"SyslogFacility":"AUTH","SyslogSeverityValue":6,"SyslogSeverity":"INFO","SeverityValue":2,"Severity":"INFO","Hostname":"debian","EventTime":"2017-01-10 19:30:28","SourceName":"sshd","ProcessID":"808","Message":"Accepted publickey for root from 10.0.0.1 port 55154 ssh2: RSA SHA256:XmQVwIT8T3Z+1ir3V4LgIgTDTqzTCaHTV8vEFb2zcBw","Counter":9,"ChecksumSHA1":"0280be7b15b0d892513588df286d1473b7b15c5a"}
{"SourceModuleName":"in","SourceModuleType":"im_file","SyslogFacilityValue":10,"SyslogFacility":"AUTHPRIV","SyslogSeverityValue":6,"SyslogSeverity":"INFO","SeverityValue":2,"Severity":"INFO","Hostname":"debian","EventTime":"2017-01-10 19:30:28","SourceName":"sshd","ProcessID":"808","Message":"pam_unix(sshd:session): session opened for user root by (uid=0)","Counter":10,"ChecksumSHA1":"0280be7b15b0d892513588df286d1473b7b15c5a"}
{"SourceModuleName":"in","SourceModuleType":"im_file","SyslogFacilityValue":3,"SyslogFacility":"DAEMON","SyslogSeverityValue":6,"SyslogSeverity":"INFO","SeverityValue":2,"Severity":"INFO","Hostname":"debian","EventTime":"2017-01-10 19:30:28","SourceName":"systemd","ProcessID":"1","Message":"Created slice User Slice of root.","Counter":11,"ChecksumSHA1":"0280be7b15b0d892513588df286d1473b7b15c5a"}
{"SourceModuleName":"in","SourceModuleType":"im_file","SyslogFacilityValue":3,"SyslogFacility":"DAEMON","SyslogSeverityValue":6,"SyslogSeverity":"INFO","SeverityValue":2,"Severity":"INFO","Hostname":"debian","EventTime":"2017-01-10 19:30:28","SourceName":"systemd","ProcessID":"1","Message":"Starting User Manager for UID 0...","Counter":12,"ChecksumSHA1":"0280be7b15b0d892513588df286d1473b7b15c5a"}
{"SourceModuleName":"in","SourceModuleType":"im_file","SyslogFacilityValue":3,"SyslogFacility":"DAEMON","SyslogSeverityValue":6,"SyslogSeverity":"INFO","SeverityValue":2,"Severity":"INFO","Hostname":"debian","EventTime":"2017-01-10 19:30:28","SourceName":"systemd-logind","ProcessID":"433","Message":"New session 1 of user root.","Counter":13,"ChecksumSHA1":"0280be7b15b0d892513588df286d1473b7b15c5a"}
{"SourceModuleName":"in","SourceModuleType":"im_file","SyslogFacilityValue":3,"SyslogFacility":"DAEMON","SyslogSeverityValue":6,"SyslogSeverity":"INFO","SeverityValue":2,"Severity":"INFO","Hostname":"debian","EventTime":"2017-01-10 19:30:28","SourceName":"systemd","ProcessID":"1","Message":"Started Session 1 of user root.","Counter":14,"ChecksumSHA1":"0280be7b15b0d892513588df286d1473b7b15c5a"}
{"SourceModuleName":"in","SourceModuleType":"im_file","SyslogFacilityValue":4,"SyslogFacility":"AUTH","SyslogSeverityValue":6,"SyslogSeverity":"INFO","SeverityValue":2,"Severity":"INFO","Hostname":"debian","EventTime":"2017-01-10 19:31:01","SourceName":"sshd","ProcessID":"808","Message":"Received disconnect from 10.0.0.1 port 55154:11: disconnected by user","Counter":15,"ChecksumSHA1":"0280be7b15b0d892513588df286d1473b7b15c5a"}
{"SourceModuleName":"in","SourceModuleType":"im_file","SyslogFacilityValue":4,"SyslogFacility":"AUTH","SyslogSeverityValue":6,"SyslogSeverity":"INFO","SeverityValue":2,"Severity":"INFO","Hostname":"debian","EventTime":"2017-01-10 19:31:01","SourceName":"sshd","ProcessID":"808","Message":"Disconnected from 10.0.0.1 port 55154","Counter":16,"ChecksumSHA1":"0280be7b15b0d892513588df286d1473b7b15c5a"}
{"SourceModuleName":"in","SourceModuleType":"im_file","SyslogFacilityValue":10,"SyslogFacility":"AUTHPRIV","SyslogSeverityValue":6,"SyslogSeverity":"INFO","SeverityValue":2,"Severity":"INFO","Hostname":"debian","EventTime":"2017-01-10 19:31:01","SourceName":"sshd","ProcessID":"808","Message":"pam_unix(sshd:session): session closed for user root","Counter":17,"ChecksumSHA1":"0280be7b15b0d892513588df286d1473b7b15c5a"}
{"SourceModuleName":"in","SourceModuleType":"im_file","SyslogFacilityValue":16,"SyslogFacility":"LOCAL0","SyslogSeverityValue":7,"SyslogSeverity":"DEBUG","SeverityValue":1,"Severity":"DEBUG","Hostname":"logserve","EventTime":"2017-01-10 20:10:33","SourceName":"logwatcher","ProcessID":"601","Message":"Logging application bound to port","ChecksumSHA1":"b63de6e273c96e0bf46534c55cdeda6b6f89e9e9"}
{"SourceModuleName":"in","SourceModuleType":"im_file","SyslogFacilityValue":16,"SyslogFacility":"LOCAL0","SyslogSeverityValue":6,"SyslogSeverity":"INFO","SeverityValue":2,"Severity":"INFO","Hostname":"logserve","EventTime":"2017-01-10 20:10:34","SourceName":"logwatcher","ProcessID":"601","Message":"Logging application started and ready","Counter":18,"ChecksumSHA1":"0280be7b15b0d892513588df286d1473b7b15c5a"}
{"SourceModuleName":"in","SourceModuleType":"im_file","SyslogFacilityValue":3,"SyslogFacility":"DAEMON","SyslogSeverityValue":3,"SyslogSeverity":"ERR","SeverityValue":4,"Severity":"ERROR","Hostname":"logserve","EventTime":"2017-01-10 21:37:05","SourceName":"systemd","ProcessID":"1","Message":"systemd-logind.service: Watchdog timeout (limit 3min)!","Counter":19,"ChecksumSHA1":"0280be7b15b0d892513588df286d1473b7b15c5a"}
{"SourceModuleName":"in","SourceModuleType":"im_file","SyslogFacilityValue":3,"SyslogFacility":"DAEMON","SyslogSeverityValue":5,"SyslogSeverity":"NOTICE","SeverityValue":2,"Severity":"INFO","Hostname":"logserve","EventTime":"2017-01-10 21:37:05","SourceName":"systemd","ProcessID":"1","Message":"systemd-logind.service: Killing process 433 (systemd-logind) with signal SIGABRT.","Counter":20,"ChecksumSHA1":"0280be7b15b0d892513588df286d1473b7b15c5a"}
{"SourceModuleName":"in","SourceModuleType":"im_file","SyslogFacilityValue":3,"SyslogFacility":"DAEMON","SyslogSeverityValue":4,"SyslogSeverity":"WARNING","SeverityValue":3,"Severity":"WARNING","Hostname":"logserve","EventTime":"2017-01-10 21:37:05","SourceName":"systemd","ProcessID":"1","Message":"systemd-logind.service: Main process exited","Counter":21,"ChecksumSHA1":"0280be7b15b0d892513588df286d1473b7b15c5a"}
{"SourceModuleName":"in","SourceModuleType":"im_file","SyslogFacilityValue":3,"SyslogFacility":"DAEMON","SyslogSeverityValue":5,"SyslogSeverity":"NOTICE","SeverityValue":2,"Severity":"INFO","Hostname":"logserve","EventTime":"2017-01-10 21:37:05","SourceName":"systemd","ProcessID":"1","Message":"systemd-logind.service: Unit entered failed state.","Counter":22,"ChecksumSHA1":"0280be7b15b0d892513588df286d1473b7b15c5a"}
{"SourceModuleName":"in","SourceModuleType":"im_file","SyslogFacilityValue":3,"SyslogFacility":"DAEMON","SyslogSeverityValue":4,"SyslogSeverity":"WARNING","SeverityValue":3,"Severity":"WARNING","Hostname":"logserve","EventTime":"2017-01-10 21:37:05","SourceName":"systemd","ProcessID":"1","Message":"systemd-logind.service: Failed with result 'watchdog'.","Counter":23,"ChecksumSHA1":"0280be7b15b0d892513588df286d1473b7b15c5a"}
{"SourceModuleName":"in","SourceModuleType":"im_file","SyslogFacilityValue":16,"SyslogFacility":"LOCAL0","SyslogSeverityValue":1,"SyslogSeverity":"ALERT","SeverityValue":3,"Severity":"WARNING","Hostname":"logserve","EventTime":"2017-01-10 21:38:00","SourceName":"logwatcher","ProcessID":"601","Message":"Logging application failed","Counter":24,"ChecksumSHA1":"0280be7b15b0d892513588df286d1473b7b15c5a"}
{"SourceModuleName":"in","SourceModuleType":"im_file","SyslogFacilityValue":3,"SyslogFacility":"DAEMON","SyslogSeverityValue":4,"SyslogSeverity":"WARNING","SeverityValue":3,"Severity":"WARNING","Hostname":"nxubuntu","EventTime":"2017-01-10 21:40:38","SourceName":"atopacctd","ProcessID":"467","Message":"reactivate process accounting","Counter":25,"ChecksumSHA1":"0280be7b15b0d892513588df286d1473b7b15c5a"}
{"SourceModuleName":"in","SourceModuleType":"im_file","SyslogFacilityValue":3,"SyslogFacility":"DAEMON","SyslogSeverityValue":3,"SyslogSeverity":"ERR","SeverityValue":4,"Severity":"ERROR","Hostname":"nxubuntu","EventTime":"2017-01-10 21:40:38","SourceName":"atopacctd","ProcessID":"467","Message":"Retrying to switch on process accounting","Counter":26,"ChecksumSHA1":"0280be7b15b0d892513588df286d1473b7b15c5a"}
{"SourceModuleName":"in","SourceModuleType":"im_file","SyslogFacilityValue":3,"SyslogFacility":"DAEMON","SyslogSeverityValue":3,"SyslogSeverity":"ERR","SeverityValue":4,"Severity":"ERROR","Hostname":"nxubuntu","EventTime":"2017-01-10 21:40:38","SourceName":"atopacctd","ProcessID":"467","Message":"(see ATOP README about kernel bug 190271)","Counter":27,"ChecksumSHA1":"0280be7b15b0d892513588df286d1473b7b15c5a"}
{"SourceModuleName":"in","SourceModuleType":"im_file","SyslogFacilityValue":4,"SyslogFacility":"AUTH","SyslogSeverityValue":6,"SyslogSeverity":"INFO","SeverityValue":2,"Severity":"INFO","Hostname":"debian","EventTime":"2017-02-02 00:17:35","SourceName":"sshd","ProcessID":"808","Message":"Failed password for invalid user john from 10.3.0.1 port 55584 ssh2","Counter":28,"ChecksumSHA1":"0280be7b15b0d892513588df286d1473b7b15c5a"}
{"SourceModuleName":"in","SourceModuleType":"im_file","SyslogFacilityValue":10,"SyslogFacility":"AUTHPRIV","SyslogSeverityValue":5,"SyslogSeverity":"NOTICE","SeverityValue":2,"Severity":"INFO","Hostname":"debian","EventTime":"2017-02-03 10:18:29","SourceName":"sshd","ProcessID":"808","Message":"pam_unix(sshd:auth): authentication failure; logname= uid=0 euid=0 tty=ssh ruser= rhost=10.0.0.2  user=user","Counter":29,"ChecksumSHA1":"0280be7b15b0d892513588df286d1473b7b15c5a"}
{"SourceModuleName":"in","SourceModuleType":"im_file","SyslogFacilityValue":4,"SyslogFacility":"AUTH","SyslogSeverityValue":6,"SyslogSeverity":"INFO","SeverityValue":2,"Severity":"INFO","Hostname":"debian","EventTime":"2017-02-03 10:18:31","SourceName":"sshd","ProcessID":"3630","Message":"Failed password for user from 10.0.0.2 port 60956 ssh2","Counter":30,"ChecksumSHA1":"0280be7b15b0d892513588df286d1473b7b15c5a"}
