1 type=CWD msg=audit(1489999368.711:35724):  cwd="/root/nxlog"
2 type=CWD msg=audit(1489999368.711:35725):  cwd="/root/nxlog"
3 type=CWD msg=audit(1489999368.711:35726):  cwd="/root/nxlog"
4 type=CWD msg=audit(1489999368.715:35727):  cwd="/root/nxlog"
5 type=CWD msg=audit(1489999368.715:35728):  cwd="/root/nxlog"
6 type=CWD msg=audit(1489999368.719:35729):  cwd="/root/nxlog"
7 type=CWD msg=audit(1489999368.719:35730):  cwd="/root/nxlog"
8 type=CWD msg=audit(1489999368.723:35731):  cwd="/root/nxlog"
9 type=CWD msg=audit(1489999368.723:35732):  cwd="/root/nxlog"
10 type=CWD msg=audit(1489999368.723:35733):  cwd="/root/nxlog"
11 type=CWD msg=audit(1489999368.727:35734):  cwd="/root/nxlog"
12 type=CWD msg=audit(1489999368.727:35735):  cwd="/root/nxlog"
13 type=CWD msg=audit(1489999368.727:35736):  cwd="/root/nxlog"
14 type=CWD msg=audit(1489999368.731:35737):  cwd="/root/nxlog"
15 type=CWD msg=audit(1489999368.731:35738):  cwd="/root/nxlog"
16 type=CWD msg=audit(1489999368.735:35739):  cwd="/root/nxlog"
17 type=CWD msg=audit(1489999368.735:35740):  cwd="/root/nxlog"
18 type=CWD msg=audit(1489999368.735:35741):  cwd="/root/nxlog"
19 type=CWD msg=audit(1489999368.739:35742):  cwd="/root/nxlog"
20 type=CWD msg=audit(1489999368.739:35743):  cwd="/root/nxlog"
21 type=CWD msg=audit(1489999368.743:35744):  cwd="/root/nxlog"
22 type=CWD msg=audit(1489999368.743:35745):  cwd="/root/nxlog"
23 type=CWD msg=audit(1489999368.747:35746):  cwd="/root/nxlog"
24 type=CWD msg=audit(1489999368.747:35747):  cwd="/root/nxlog"
25 type=CWD msg=audit(1489999368.747:35748):  cwd="/root/nxlog"
26 type=CWD msg=audit(1489999368.751:35749):  cwd="/root/nxlog"
27 type=CWD msg=audit(1489999368.751:35750):  cwd="/root/nxlog"
28 type=CWD msg=audit(1489999368.755:35751):  cwd="/root/nxlog"
29 type=CWD msg=audit(1489999368.755:35752):  cwd="/root/nxlog"
30 type=CWD msg=audit(1489999368.759:35753):  cwd="/root/nxlog"
31 type=CWD msg=audit(1489999368.759:35754):  cwd="/root/nxlog"
32 type=CWD msg=audit(1489999368.759:35755):  cwd="/root/nxlog"
33 type=CWD msg=audit(1489999368.763:35756):  cwd="/root/nxlog"
34 type=CWD msg=audit(1489999368.763:35757):  cwd="/root/nxlog"
35 type=CWD msg=audit(1489999368.767:35758):  cwd="/root/nxlog"
36 type=CWD msg=audit(1489999368.767:35759):  cwd="/root/nxlog"
37 type=CWD msg=audit(1489999368.767:35760):  cwd="/root/nxlog"
38 type=CWD msg=audit(1489999368.771:35761):  cwd="/root/nxlog"
39 type=CWD msg=audit(1489999368.771:35762):  cwd="/root/nxlog"
40 type=CWD msg=audit(1489999368.775:35763):  cwd="/root/nxlog"
41 type=CWD msg=audit(1489999368.775:35764):  cwd="/root/nxlog"
42 type=CWD msg=audit(1489999368.779:35765):  cwd="/root/nxlog"
43 type=CWD msg=audit(1489999368.779:35766):  cwd="/root/nxlog"
44 type=CWD msg=audit(1489999368.779:35767):  cwd="/root/nxlog"
45 type=CWD msg=audit(1489999368.783:35768):  cwd="/root/nxlog"
46 type=CWD msg=audit(1489999368.783:35769):  cwd="/root/nxlog"
47 type=CWD msg=audit(1489999368.787:35770):  cwd="/root/nxlog"
48 type=CWD msg=audit(1489999368.787:35771):  cwd="/root/nxlog"
49 type=CWD msg=audit(1489999368.791:35772):  cwd="/root/nxlog"
50 type=CWD msg=audit(1489999368.791:35773):  cwd="/root/nxlog"
51 type=CWD msg=audit(1489999368.791:35774):  cwd="/root/nxlog"
52 type=CWD msg=audit(1489999368.795:35775):  cwd="/root/nxlog"
53 type=CWD msg=audit(1489999368.795:35776):  cwd="/root/nxlog"
54 type=CWD msg=audit(1489999368.799:35777):  cwd="/root/nxlog"
55 type=CWD msg=audit(1489999368.799:35778):  cwd="/root/nxlog"
56 type=CWD msg=audit(1489999368.799:35779):  cwd="/root/nxlog"
57 type=CWD msg=audit(1489999368.803:35780):  cwd="/root/nxlog"
58 type=CWD msg=audit(1489999368.803:35781):  cwd="/root/nxlog"
59 type=CWD msg=audit(1489999368.807:35782):  cwd="/root/nxlog"
60 type=CWD msg=audit(1489999368.807:35783):  cwd="/root/nxlog"
61 type=CWD msg=audit(1489999368.807:35784):  cwd="/root/nxlog"
62 type=CWD msg=audit(1489999368.811:35785):  cwd="/root/nxlog"
63 type=CWD msg=audit(1489999368.811:35786):  cwd="/root/nxlog"
64 type=CWD msg=audit(1489999368.815:35787):  cwd="/root/nxlog"
65 type=CWD msg=audit(1489999368.815:35788):  cwd="/root/nxlog"
66 type=CWD msg=audit(1489999368.815:35789):  cwd="/root/nxlog"
67 type=CWD msg=audit(1489999368.819:35790):  cwd="/root/nxlog"
