%YAML 1.1
%TAG !u! tag:unity3d.com,2011:
--- !u!74 &7400000
AnimationClip:
  m_ObjectHideFlags: 0
  m_CorrespondingSourceObject: {fileID: 0}
  m_PrefabInstance: {fileID: 0}
  m_PrefabAsset: {fileID: 0}
  m_Name: flying2
  serializedVersion: 6
  m_Legacy: 0
  m_Compressed: 0
  m_UseHighQualityCurve: 1
  m_RotationCurves: []
  m_CompressedRotationCurves: []
  m_EulerCurves: []
  m_PositionCurves: []
  m_ScaleCurves: []
  m_FloatCurves: []
  m_PPtrCurves:
  - curve:
    - time: 0
      value: {fileID: -1562373050, guid: e51c7fc05e516fa41ab3b21df3910686, type: 3}
    - time: 0.13333334
      value: {fileID: -975353295, guid: e51c7fc05e516fa41ab3b21df3910686, type: 3}
    - time: 0.25
      value: {fileID: -615266682, guid: e51c7fc05e516fa41ab3b21df3910686, type: 3}
    - time: 0.38333333
      value: {fileID: -1976987295, guid: e51c7fc05e516fa41ab3b21df3910686, type: 3}
    - time: 0.5
      value: {fileID: -1220474603, guid: e51c7fc05e516fa41ab3b21df3910686, type: 3}
    - time: 0.6333333
      value: {fileID: 1127730167, guid: e51c7fc05e516fa41ab3b21df3910686, type: 3}
    - time: 0.75
      value: {fileID: 457612918, guid: e51c7fc05e516fa41ab3b21df3910686, type: 3}
    - time: 0.8833333
      value: {fileID: -670607531, guid: e51c7fc05e516fa41ab3b21df3910686, type: 3}
    - time: 1.0166667
      value: {fileID: -1562373050, guid: e51c7fc05e516fa41ab3b21df3910686, type: 3}
    attribute: m_Sprite
    path: 
    classID: 212
    script: {fileID: 0}
  m_SampleRate: 60
  m_WrapMode: 0
  m_Bounds:
    m_Center: {x: 0, y: 0, z: 0}
    m_Extent: {x: 0, y: 0, z: 0}
  m_ClipBindingConstant:
    genericBindings:
    - serializedVersion: 2
      path: 0
      attribute: 0
      script: {fileID: 0}
      typeID: 212
      customType: 23
      isPPtrCurve: 1
    pptrCurveMapping:
    - {fileID: -1562373050, guid: e51c7fc05e516fa41ab3b21df3910686, type: 3}
    - {fileID: -975353295, guid: e51c7fc05e516fa41ab3b21df3910686, type: 3}
    - {fileID: -615266682, guid: e51c7fc05e516fa41ab3b21df3910686, type: 3}
    - {fileID: -1976987295, guid: e51c7fc05e516fa41ab3b21df3910686, type: 3}
    - {fileID: -1220474603, guid: e51c7fc05e516fa41ab3b21df3910686, type: 3}
    - {fileID: 1127730167, guid: e51c7fc05e516fa41ab3b21df3910686, type: 3}
    - {fileID: 457612918, guid: e51c7fc05e516fa41ab3b21df3910686, type: 3}
    - {fileID: -670607531, guid: e51c7fc05e516fa41ab3b21df3910686, type: 3}
    - {fileID: -1562373050, guid: e51c7fc05e516fa41ab3b21df3910686, type: 3}
  m_AnimationClipSettings:
    serializedVersion: 2
    m_AdditiveReferencePoseClip: {fileID: 0}
    m_AdditiveReferencePoseTime: 0
    m_StartTime: 0
    m_StopTime: 1.0333333
    m_OrientationOffsetY: 0
    m_Level: 0
    m_CycleOffset: 0
    m_HasAdditiveReferencePose: 0
    m_LoopTime: 1
    m_LoopBlend: 0
    m_LoopBlendOrientation: 0
    m_LoopBlendPositionY: 0
    m_LoopBlendPositionXZ: 0
    m_KeepOriginalOrientation: 0
    m_KeepOriginalPositionY: 1
    m_KeepOriginalPositionXZ: 0
    m_HeightFromFeet: 0
    m_Mirror: 0
  m_EditorCurves: []
  m_EulerEditorCurves: []
  m_HasGenericRootTransform: 0
  m_HasMotionFloatCurves: 0
  m_Events: []
