%YAML 1.1
%TAG !u! tag:unity3d.com,2011:
--- !u!1045 &1
EditorBuildSettings:
  m_ObjectHideFlags: 0
  serializedVersion: 2
  m_Scenes:
  - enabled: 1
    path: Assets/Scenes/Menu.unity
    guid: b98c88b4ef5f7564e9018a7caaa3fa60
  - enabled: 1
    path: Assets/Scenes/Gameplay.unity
    guid: 8c9cfa26abfee488c85f1582747f6a02
  - enabled: 1
    path: Assets/Scenes/GameplayBot.unity
    guid: e10f13aa1eae4894390638a72d4ee941
  m_configObjects: {}
