^E:\HK232\LẬP TRÌNH GAME\BTL2\BLOCKBALL\BLOCK_BALL\BLOCK_BALL\BLOCK_BALL.CPP
E:\HK232\LậP TRìNH GAME\BTL2\BLOCKBALL\BLOCK_BALL\BLOCK_BALL\RELEASE\VC143.PDB
E:\HK232\LậP TRìNH GAME\BTL2\BLOCKBALL\BLOCK_BALL\BLOCK_BALL\RELEASE\BLOCK_BALL.OBJ
