%YAML 1.1
%TAG !u! tag:unity3d.com,2011:
--- !u!114 &11400000
MonoBehaviour:
  m_ObjectHideFlags: 0
  m_CorrespondingSourceObject: {fileID: 0}
  m_PrefabInstance: {fileID: 0}
  m_PrefabAsset: {fileID: 0}
  m_GameObject: {fileID: 0}
  m_Enabled: 1
  m_EditorHideFlags: 0
  m_Script: {fileID: 11500000, guid: 4455327611829864db2d2dc83185e5a1, type: 3}
  m_Name: Sound Map Config
  m_EditorClassIdentifier: 
  MapPath:
  - Type: 0
    Path: SoundMaps/Common Sound Map
  - Type: 1
    Path: SoundMaps/MainMenu Sound Map
  - Type: 2
    Path: SoundMaps/Gameplay1 Sound Map
  - Type: 3
    Path: SoundMaps/Gameplay2 Sound Map
