%YAML 1.1
%TAG !u! tag:unity3d.com,2011:
--- !u!1045 &1
EditorBuildSettings:
  m_ObjectHideFlags: 0
  serializedVersion: 2
  m_Scenes:
  - enabled: 1
    path: Assets/Scenes/MainMenu.unity
    guid: aff5d2376c4cbe64dab05c524333f62d
  - enabled: 1
    path: Assets/Scenes/Gameplay.unity
    guid: 2cda990e2423bbf4892e6590ba056729
  m_configObjects: {}
