<?xml version="1.0" encoding="utf-8"?>
<!-- Generator: Adobe Illustrator 24.0.0, SVG Export Plug-In . SVG Version: 6.00 Build 0)  -->
<svg version="1.1" id="Layer_1" xmlns="http://www.w3.org/2000/svg" xmlns:xlink="http://www.w3.org/1999/xlink" x="0px" y="0px"
	 viewBox="0 0 32 32" style="enable-background:new 0 0 32 32;" xml:space="preserve">
<style type="text/css">
	.st0{fill:#16B5A4;}
	.st1{fill:#FFFFFF;}
</style>
<g>
	<circle class="st0" cx="16" cy="16" r="16"/>
	<g>
		<path class="st1" d="M24.88,15.66c-1.64-1.99-5.1-4.32-8.88-4.32c-3.79,0-7.26,2.34-8.88,4.32c-0.16,0.2-0.16,0.48,0,0.67
			c1.67,2.04,5.15,4.32,8.88,4.32c3.87,0,7.31-2.41,8.88-4.32C25.04,16.14,25.04,15.86,24.88,15.66z M19.6,16
			c0,1.98-1.61,3.6-3.6,3.6c-1.98,0-3.6-1.61-3.6-3.6c0-1.98,1.61-3.6,3.6-3.6C17.98,12.4,19.6,14.02,19.6,16L19.6,16z M8.24,16
			c0.6-0.62,2.03-1.96,4.05-2.81c-1.27,1.66-1.27,3.96,0,5.63C10.76,18.16,9.34,17.14,8.24,16z M19.71,18.81
			c1.27-1.66,1.27-3.96,0-5.63c1.53,0.65,2.96,1.68,4.05,2.81C23.16,16.62,21.72,17.96,19.71,18.81z"/>
		<path class="st1" d="M14.2,16c0,0.99,0.81,1.8,1.8,1.8c0.99,0,1.8-0.81,1.8-1.8s-0.81-1.8-1.8-1.8C15.01,14.2,14.2,15.01,14.2,16z
			 M16.74,16c0,0.41-0.33,0.74-0.74,0.74c-0.41,0-0.74-0.33-0.74-0.74c0-0.41,0.33-0.74,0.74-0.74C16.41,15.26,16.74,15.59,16.74,16
			z"/>
		<path class="st1" d="M16,9.29c0.29,0,0.53-0.24,0.53-0.53V7.53C16.53,7.24,16.29,7,16,7c-0.29,0-0.53,0.24-0.53,0.53v1.24
			C15.47,9.06,15.71,9.29,16,9.29z"/>
		<path class="st1" d="M19.16,10c0.25,0.14,0.58,0.06,0.72-0.2l0.7-1.24c0.14-0.25,0.06-0.58-0.2-0.72
			c-0.25-0.14-0.58-0.06-0.72,0.2l-0.7,1.24C18.82,9.53,18.9,9.86,19.16,10z"/>
		<path class="st1" d="M12.12,9.8c0.14,0.25,0.47,0.34,0.72,0.2c0.25-0.14,0.34-0.47,0.2-0.72l-0.7-1.24
			c-0.14-0.25-0.47-0.34-0.72-0.2c-0.25,0.14-0.34,0.47-0.2,0.72L12.12,9.8z"/>
		<path class="st1" d="M16,22.71c-0.29,0-0.53,0.24-0.53,0.53v1.24c0,0.29,0.24,0.53,0.53,0.53c0.29,0,0.53-0.24,0.53-0.53v-1.24
			C16.53,22.94,16.29,22.71,16,22.71z"/>
		<path class="st1" d="M12.84,22c-0.25-0.14-0.58-0.06-0.72,0.2l-0.7,1.24c-0.14,0.25-0.06,0.58,0.2,0.72
			c0.25,0.14,0.58,0.06,0.72-0.2l0.7-1.24C13.18,22.47,13.1,22.14,12.84,22z"/>
		<path class="st1" d="M19.88,22.2c-0.14-0.25-0.47-0.34-0.72-0.2c-0.25,0.14-0.34,0.47-0.2,0.72l0.7,1.24
			c0.14,0.25,0.47,0.34,0.72,0.2c0.25-0.14,0.34-0.47,0.2-0.72L19.88,22.2z"/>
	</g>
</g>
</svg>
