<?xml version="1.0" encoding="utf-8"?>
<!-- Generator: Adobe Illustrator 24.0.0, SVG Export Plug-In . SVG Version: 6.00 Build 0)  -->
<svg version="1.1" id="Layer_1" xmlns="http://www.w3.org/2000/svg" xmlns:xlink="http://www.w3.org/1999/xlink" x="0px" y="0px"
	 viewBox="0 0 32 32" style="enable-background:new 0 0 32 32;" xml:space="preserve">
<style type="text/css">
	.st0{fill:#16B5A4;}
	.st1{fill:#FFFFFF;}
</style>
<g>
	<circle class="st0" cx="16" cy="16" r="16"/>
	<g>
		<path class="st1" d="M22.38,23.4h-1.1V9.97c0-0.3-0.25-0.55-0.55-0.55h-4.11V8.05c0-0.3-0.25-0.55-0.55-0.55h-3.8
			c-0.3,0-0.55,0.25-0.55,0.55v1.37h-0.45c-0.3,0-0.55,0.25-0.55,0.55V23.4h-1.1c-0.3,0-0.55,0.25-0.55,0.55s0.25,0.55,0.55,0.55
			h12.75c0.3,0,0.55-0.25,0.55-0.55S22.68,23.4,22.38,23.4z M12.81,8.6h2.71v0.82h-2.71V8.6z M14.9,23.4v-2.33h2.19v2.33H14.9z
			 M18.19,23.4v-2.33h0.24c0.3,0,0.55-0.25,0.55-0.55s-0.25-0.55-0.55-0.55c-1.91,0-3.1,0-4.87,0c-0.3,0-0.55,0.25-0.55,0.55
			s0.25,0.55,0.55,0.55h0.24v2.33h-1.99V10.52h8.36V23.4H18.19z M15.21,12.13c0,0.3-0.25,0.55-0.55,0.55h-0.62
			c-0.3,0-0.55-0.25-0.55-0.55s0.25-0.55,0.55-0.55h0.62C14.97,11.58,15.21,11.82,15.21,12.13z M18.47,12.13
			c0,0.3-0.25,0.55-0.55,0.55H17.3c-0.3,0-0.55-0.25-0.55-0.55s0.25-0.55,0.55-0.55h0.62C18.22,11.58,18.47,11.82,18.47,12.13z
			 M15.21,14.18c0,0.3-0.25,0.55-0.55,0.55h-0.62c-0.3,0-0.55-0.25-0.55-0.55s0.25-0.55,0.55-0.55h0.62
			C14.97,13.64,15.21,13.88,15.21,14.18z M18.47,14.18c0,0.3-0.25,0.55-0.55,0.55H17.3c-0.3,0-0.55-0.25-0.55-0.55
			s0.25-0.55,0.55-0.55h0.62C18.22,13.64,18.47,13.88,18.47,14.18z M15.21,16.24c0,0.3-0.25,0.55-0.55,0.55h-0.62
			c-0.3,0-0.55-0.25-0.55-0.55s0.25-0.55,0.55-0.55h0.62C14.97,15.69,15.21,15.94,15.21,16.24z M18.47,16.24
			c0,0.3-0.25,0.55-0.55,0.55H17.3c-0.3,0-0.55-0.25-0.55-0.55s0.25-0.55,0.55-0.55h0.62C18.22,15.69,18.47,15.94,18.47,16.24z
			 M15.21,18.3c0,0.3-0.25,0.55-0.55,0.55h-0.62c-0.3,0-0.55-0.25-0.55-0.55s0.25-0.55,0.55-0.55h0.62
			C14.97,17.75,15.21,17.99,15.21,18.3z M18.47,18.3c0,0.3-0.25,0.55-0.55,0.55H17.3c-0.3,0-0.55-0.25-0.55-0.55
			s0.25-0.55,0.55-0.55h0.62C18.22,17.75,18.47,17.99,18.47,18.3z"/>
	</g>
</g>
</svg>
