<svg id="Component_7_1" data-name="Component 7 – 1" xmlns="http://www.w3.org/2000/svg" width="177.1" height="227" viewBox="0 0 177.1 227">
  <path id="Path_11" data-name="Path 11" d="M524.95,422.171l-6.087-8.195-23.4-31.5-6.087-8.2-6.088-8.2-22.032-29.662L454,326.646l-5.632-7.576a5.414,5.414,0,0,0-4.361-2.2H356.66a2.72,2.72,0,0,0-2.183,4.339l4.035,5.436,7.255,9.77,69.779,93.955-69.779,93.955-7.255,9.77-4.035,5.442a2.716,2.716,0,0,0,2.183,4.333h87.352a5.424,5.424,0,0,0,4.361-2.194L454,534.1l7.255-9.77,22.032-29.662,6.088-8.195,6.087-8.2,23.4-31.5,6.087-8.195,6.088-8.195v-.011Zm-12.175,16.4-23.4,31.5-6.088,8.195-6.088,8.2-28.12,37.857-5.947,8.011a4.36,4.36,0,0,1-3.5,1.759h-64.63a2.169,2.169,0,0,1-1.743-3.464l4.681-6.305,63.69-85.755,6.088-8.2-6.088-8.2-63.69-85.755-4.681-6.305a2.17,2.17,0,0,1,1.743-3.464h64.63a4.365,4.365,0,0,1,3.5,1.765l5.947,8.005,28.12,37.857,6.088,8.2,6.088,8.2,23.4,31.5,6.088,8.2Z" transform="translate(-353.937 -316.871)" fill="#f3385a"/>
  <path id="Path_12" data-name="Path 12" d="M542.806,449.047l-23.4,31.5-6.088,8.2-6.088,8.195-33.181,44.678A3.418,3.418,0,0,1,471.306,543H429.5a1.64,1.64,0,0,1-1.319-2.617l55.658-74.943,6.088-8.195,6.088-8.195v-.011l-6.088-8.195-6.088-8.195L428.182,357.71a1.641,1.641,0,0,1,1.319-2.618h41.8a3.424,3.424,0,0,1,2.748,1.385l33.181,44.672,6.088,8.2,6.088,8.2Z" transform="translate(-390.057 -335.547)" fill="#fff"/>
</svg>
