<svg xmlns="http://www.w3.org/2000/svg" width="212.189" height="271.976" viewBox="0 0 212.189 271.976">
  <g id="Group_1809" data-name="Group 1809" transform="translate(-253.098 -97.703)" opacity="0.05">
    <path id="Path_10299" data-name="Path 10299" d="M457.993,223.866l-7.294-9.819L422.669,176.3l-7.294-9.825-7.294-9.818-26.4-35.539-8.693-11.706-6.747-9.076a6.487,6.487,0,0,0-5.225-2.635H256.36a3.259,3.259,0,0,0-2.616,5.2l4.834,6.513,8.693,11.706,83.6,112.571-83.6,112.571-8.693,11.706-4.834,6.52a3.254,3.254,0,0,0,2.616,5.192H361.019a6.5,6.5,0,0,0,5.225-2.629l6.747-9.083,8.693-11.706,26.4-35.539,7.294-9.818,7.294-9.825,28.03-37.745,7.294-9.818,7.294-9.819v-.013Zm-14.588,19.65-28.03,37.745-7.294,9.818-7.294,9.825L367.1,346.262l-7.125,9.6a5.224,5.224,0,0,1-4.2,2.108H278.34a2.6,2.6,0,0,1-2.089-4.151l5.609-7.554,76.31-102.746,7.294-9.825-7.294-9.825L281.859,121.12l-5.609-7.554a2.6,2.6,0,0,1,2.089-4.151h77.435a5.231,5.231,0,0,1,4.2,2.115l7.125,9.591,33.691,45.357,7.294,9.825,7.294,9.818,28.03,37.745,7.294,9.825Z" transform="translate(0)" fill="#542d60"/>
    <path id="Path_10300" data-name="Path 10300" d="M524.8,279.55l-28.031,37.745-7.294,9.825-7.294,9.818-39.756,53.53a4.1,4.1,0,0,1-3.292,1.653H389.048a1.966,1.966,0,0,1-1.581-3.136l66.686-89.791,7.294-9.818,7.294-9.819v-.013l-7.294-9.818-7.294-9.819-66.686-89.791a1.967,1.967,0,0,1,1.581-3.136h50.088a4.1,4.1,0,0,1,3.292,1.659l39.756,53.523,7.294,9.818,7.294,9.825Z" transform="translate(-88.69 -45.859)" fill="#542d60"/>
  </g>
</svg>
