<svg id="Group_21" data-name="Group 21" xmlns="http://www.w3.org/2000/svg" width="125.368" height="110" viewBox="0 0 125.368 110">
  <path id="Path_46" data-name="Path 46" d="M436.807,367.9l-2.95-3.971L422.52,348.66l-2.95-3.973-2.95-3.971-10.676-14.374-3.516-4.734-2.729-3.671a2.624,2.624,0,0,0-2.113-1.066H355.257a1.318,1.318,0,0,0-1.058,2.1l1.955,2.634,3.516,4.734,33.813,45.529L359.67,417.4l-3.516,4.734-1.955,2.637a1.316,1.316,0,0,0,1.058,2.1h42.329a2.629,2.629,0,0,0,2.113-1.063l2.729-3.674,3.516-4.734,10.676-14.374,2.95-3.971,2.95-3.974,11.337-15.266,2.95-3.971,2.95-3.971v-.005Zm-5.9,7.947L419.57,391.111l-2.95,3.971-2.95,3.974L400.044,417.4l-2.882,3.882a2.113,2.113,0,0,1-1.7.852H364.146a1.051,1.051,0,0,1-.845-1.679l2.268-3.055,30.863-41.555,2.95-3.974-2.95-3.974L365.57,326.342l-2.268-3.055a1.052,1.052,0,0,1,.845-1.679h31.318a2.115,2.115,0,0,1,1.7.855l2.882,3.879,13.626,18.345,2.95,3.973,2.95,3.971L430.907,367.9l2.95,3.974Z" transform="translate(-353.937 -316.871)" fill="#0e0810"/>
  <path id="Path_47" data-name="Path 47" d="M483.559,400.621l-11.337,15.266-2.95,3.974-2.95,3.971-16.079,21.65a1.656,1.656,0,0,1-1.332.668H428.653a.8.8,0,0,1-.639-1.268l26.971-36.316,2.95-3.971,2.95-3.971v-.005l-2.95-3.971-2.95-3.971-26.971-36.316a.8.8,0,0,1,.639-1.269h20.258a1.659,1.659,0,0,1,1.332.671l16.079,21.647,2.95,3.971,2.95,3.974Z" transform="translate(-409.539 -345.621)" fill="#0e0810"/>
  <g id="Group_20" data-name="Group 20" transform="translate(62.683)">
    <path id="Path_48" data-name="Path 48" d="M669.319,318.971l-1.96,2.637-3.516,4.734-33.811,45.526-2.95-3.971-2.95-3.971L612.795,348.66l-2.95-3.973-2.95-3.971,10.674-14.374,3.516-4.734,2.729-3.671a2.632,2.632,0,0,1,2.116-1.066h42.334A1.316,1.316,0,0,1,669.319,318.971Z" transform="translate(-606.895 -316.871)" fill="#0e0810"/>
    <path id="Path_49" data-name="Path 49" d="M668.263,593.833H625.929a2.637,2.637,0,0,1-2.116-1.063l-2.729-3.674-3.516-4.734L606.9,569.988l2.95-3.971,2.95-3.974,11.337-15.266,2.95-3.971,2.95-3.971,33.811,45.526,3.516,4.734,1.96,2.639A1.314,1.314,0,0,1,668.263,593.833Z" transform="translate(-606.895 -483.833)" fill="#0e0810"/>
  </g>
</svg>
