{"id":1,"common_name":"Red-vented cockatoo,Katala,Abukay","scientific_name":"Cacatua haematuropygia","all_names":["cacatua haematuropygia","red-vented cockatoo","katala","abukay","cacatua-haematuropygia","red vented cockatoo","red vented-cockatoo","red-vented-cockatoo","cacatuahaematuropygia","redventedcockatoo"]}
{"id":2,"common_name":"Pink-bellied imperial pigeon,Balud","scientific_name":"Ducula poliocephala","all_names":["ducula poliocephala","pink-bellied imperial pigeon","balud","ducula-poliocephala","pink bellied imperial pigeon","pink bellied imperial-pigeon","pink bellied-imperial pigeon","pink bellied-imperial-pigeon","pink-bellied imperial-pigeon","pink-bellied-imperial pigeon","pink-bellied-imperial-pigeon","duculapoliocephala","pinkbelliedimperialpigeon"]}
{"id":3,"common_name":"Colasisi,Kulasisi","scientific_name":"Loriculus philippensis","all_names":["loriculus philippensis","colasisi","kulasisi","loriculus-philippensis","loriculusphilippensis"]}
{"id":4,"common_name":"Blue-naped parrot,Pikoy","scientific_name":"Tanygnathus lucionensis","all_names":["tanygnathus lucionensis","blue-naped parrot","pikoy","tanygnathus-lucionensis","blue naped parrot","blue naped-parrot","blue-naped-parrot","tanygnathuslucionensis","bluenapedparrot"]}
{"id":5,"common_name":"Hawksbill turtle,Karahan,Kara,Ulinaban,Sisik,Sisikan","scientific_name":"Eretmochelys imbricata","all_names":["eretmochelys imbricata","hawksbill turtle","karahan","kara","ulinaban","sisik","sisikan","eretmochelys-imbricata","hawksbill-turtle","eretmochelysimbricata","hawksbillturtle"]}
{"id":6,"common_name":"Indo-Pacific crocodile,Saltwater crocodile,Buwaya","scientific_name":"Crocodylus porosus","all_names":["crocodylus porosus","indo-pacific crocodile","saltwater crocodile","buwaya","crocodylus-porosus","indo pacific crocodile","indo pacific-crocodile","indo-pacific-crocodile","saltwater-crocodile","crocodylusporosus","indopacificcrocodile","saltwatercrocodile"]}
{"id":7,"common_name":"Leatherback turtle,Balimbing,Kantuhan,Benerakan,Galangan","scientific_name":"Dermochelys coriacea","all_names":["dermochelys coriacea","leatherback turtle","balimbing","kantuhan","benerakan","galangan","dermochelys-coriacea","leatherback-turtle","dermochelyscoriacea","leatherbackturtle"]}
{"id":8,"common_name":"Palawan forest turtle,Bakoko,Bao","scientific_name":"Siebenrockiella leytensis","all_names":["siebenrockiella leytensis","palawan forest turtle","bakoko","bao","siebenrockiella-leytensis","palawan forest-turtle","palawan-forest turtle","palawan-forest-turtle","siebenrockiellaleytensis","palawanforestturtle"]}
{"id":9,"common_name":"Philippine deer,Usa,Bugsok","scientific_name":"Rusa marianna","all_names":["rusa marianna","philippine deer","usa","bugsok","rusa-marianna","philippine-deer","rusamarianna","philippinedeer"]}
{"id":10,"common_name":"Palawan pangolin,Balintong","scientific_name":"Manis culionensis","all_names":["manis culionensis","palawan pangolin","balintong","manis-culionensis","palawan-pangolin","manisculionensis","palawanpangolin"]}
{"id":11,"common_name":"Nicobar pigeon,Siete colores","scientific_name":"Caloenas nicobarica","all_names":["caloenas nicobarica","nicobar pigeon","siete colores","caloenas-nicobarica","nicobar-pigeon","siete-colores","caloenasnicobarica","nicobarpigeon","sietecolores"]}
{"id":12,"common_name":"Green turtle,Payukan,Katuan,Bildog,Tuod,Talisayon,Pudno","scientific_name":"Chelonia mydas","all_names":["chelonia mydas","green turtle","payukan","katuan","bildog","tuod","talisayon","pudno","chelonia-mydas","green-turtle","cheloniamydas","greenturtle"]}
{"id":13,"common_name":"Olive ridley turtle,Pawikan,Kantiwan,Lambangan,Mukoy,Lunok","scientific_name":"Lepidochelys olivacea","all_names":["lepidochelys olivacea","olive ridley turtle","pawikan","kantiwan","lambangan","mukoy","lunok","lepidochelys-olivacea","olive ridley-turtle","olive-ridley turtle","olive-ridley-turtle","lepidochelysolivacea","oliveridleyturtle"]}
{"id":14,"common_name":"Palawan hornbill,Talusi","scientific_name":"Anthracoceros marchei","all_names":["anthracoceros marchei","palawan hornbill","talusi","anthracoceros-marchei","palawan-hornbill","anthracocerosmarchei","palawanhornbill"]}
{"id":15,"common_name":"Luzon hornbill,Tariktik","scientific_name":"Penelopides manillae","all_names":["penelopides manillae","luzon hornbill","tariktik","penelopides-manillae","luzon-hornbill","penelopidesmanillae","luzonhornbill"]}
{"id":16,"common_name":"Asian leaf turtle","scientific_name":"Cyclemys dentata","all_names":["cyclemys dentata","asian leaf turtle","cyclemys-dentata","asian leaf-turtle","asian-leaf turtle","asian-leaf-turtle","cyclemysdentata","asianleafturtle"]}
{"id":17,"common_name":"Philippine tarsier,Mago,Mawumag,Mamag","scientific_name":"Tarsius syrichta,Carlito syrichta","all_names":["tarsius syrichta","carlito syrichta","philippine tarsier","mago","mawumag","mamag","tarsius-syrichta","carlito-syrichta","philippine-tarsier","tarsiussyrichta","carlitosyrichta","philippinetarsier"]}
{"id":18,"common_name":"Binturong","scientific_name":"Arctictis binturong","all_names":["arctictis binturong","binturong","arctictis-binturong","arctictisbinturong"]}
{"id":19,"common_name":"Blue-crowned racket-tail,Loro,Kaguit","scientific_name":"Prioniturus discurus","all_names":["prioniturus discurus","blue-crowned racket-tail","loro","kaguit","prioniturus-discurus","blue crowned racket tail","blue crowned racket-tail","blue crowned-racket tail","blue crowned-racket-tail","blue-crowned racket tail","blue-crowned-racket tail","blue-crowned-racket-tail","prioniturusdiscurus","bluecrownedrackettail"]}
{"id":20,"common_name":"Philippine sailfin lizard,Ibid,layagan","scientific_name":"Hydrosaurus pustulatus","all_names":["hydrosaurus pustulatus","philippine sailfin lizard","ibid","layagan","hydrosaurus-pustulatus","philippine sailfin-lizard","philippine-sailfin lizard","philippine-sailfin-lizard","hydrosauruspustulatus","philippinesailfinlizard"]}
{"id":21,"common_name":"Northern Philippine cobra,Ulupong,Carasaen,Agwáson,banákon","scientific_name":"Naja philippinensis","all_names":["naja philippinensis","northern philippine cobra","ulupong","carasaen","agwáson","banákon","naja-philippinensis","northern philippine-cobra","northern-philippine cobra","northern-philippine-cobra","najaphilippinensis","northernphilippinecobra"]}
{"id":22,"common_name":"Philippine yellow-throated cobra,Ulupong,Carasaen,Agwáson,banákon","scientific_name":"Naja samarensis","all_names":["naja samarensis","philippine yellow-throated cobra","ulupong","carasaen","agwáson","banákon","naja-samarensis","philippine yellow throated cobra","philippine yellow throated-cobra","philippine yellow-throated-cobra","philippine-yellow throated cobra","philippine-yellow throated-cobra","philippine-yellow-throated cobra","philippine-yellow-throated-cobra","najasamarensis","philippineyellowthroatedcobra"]}
{"id":23,"common_name":"Malayan box turtle,Southeast Asian box turtle,Pagong,Bao","scientific_name":"Cuora amboinensis","all_names":["cuora amboinensis","malayan box turtle","southeast asian box turtle","pagong","bao","cuora-amboinensis","malayan box-turtle","malayan-box turtle","malayan-box-turtle","southeast asian box-turtle","southeast asian-box turtle","southeast asian-box-turtle","southeast-asian box turtle","southeast-asian box-turtle","southeast-asian-box turtle","southeast-asian-box-turtle","cuoraamboinensis","malayanboxturtle","southeastasianboxturtle"]}
{"id":24,"common_name":"Philippine-Bornean temple pit viper,North Philippine temple pitviper","scientific_name":"Tropidolaemus subannulatus","all_names":["tropidolaemus subannulatus","philippine-bornean temple pit viper","north philippine temple pitviper","tropidolaemus-subannulatus","philippine bornean temple pit viper","philippine bornean temple pit-viper","philippine bornean temple-pit viper","philippine bornean temple-pit-viper","philippine bornean-temple pit viper","philippine bornean-temple pit-viper","philippine bornean-temple-pit viper","philippine bornean-temple-pit-viper","philippine-bornean temple pit-viper","philippine-bornean temple-pit viper","philippine-bornean temple-pit-viper","philippine-bornean-temple pit viper","philippine-bornean-temple pit-viper","philippine-bornean-temple-pit viper","philippine-bornean-temple-pit-viper","north philippine temple-pitviper","north philippine-temple pitviper","north philippine-temple-pitviper","north-philippine temple pitviper","north-philippine temple-pitviper","north-philippine-temple pitviper","north-philippine-temple-pitviper","tropidolaemussubannulatus","philippineborneantemplepitviper","northphilippinetemplepitviper"]}
{"id":25,"common_name":"Visayan hornbill,Talusi,Taasi","scientific_name":"Penelopides panini","all_names":["penelopides panini","visayan hornbill","talusi","taasi","penelopides-panini","visayan-hornbill","penelopidespanini","visayanhornbill"]}
{"id":26,"common_name":"Mindoro bleeding-heart,Puñalada","scientific_name":"Gallicolumba platenae","all_names":["gallicolumba platenae","mindoro bleeding-heart","puñalada","gallicolumba-platenae","mindoro bleeding heart","mindoro-bleeding heart","mindoro-bleeding-heart","gallicolumbaplatenae","mindorobleedingheart"]}
{"id":27,"common_name":"Negros bleeding-heart,Puñalada","scientific_name":"Gallicolumba keayi","all_names":["gallicolumba keayi","negros bleeding-heart","puñalada","gallicolumba-keayi","negros bleeding heart","negros-bleeding heart","negros-bleeding-heart","gallicolumbakeayi","negrosbleedingheart"]}
{"id":28,"common_name":"Green racket-tail,Kaguit","scientific_name":"Prioniturus luconensis","all_names":["prioniturus luconensis","green racket-tail","kaguit","prioniturus-luconensis","green racket tail","green-racket tail","green-racket-tail","prioniturusluconensis","greenrackettail"]}
{"id":29,"common_name":"Blue-backed parrot,Loro","scientific_name":"Tanygnathus sumatranus","all_names":["tanygnathus sumatranus","blue-backed parrot","loro","tanygnathus-sumatranus","blue backed parrot","blue backed-parrot","blue-backed-parrot","tanygnathussumatranus","bluebackedparrot"]}
{"id":30,"common_name":"Philippine crocodile,Buwaya,Bukarot","scientific_name":"Crocodylus mindorensis","all_names":["crocodylus mindorensis","philippine crocodile","buwaya","bukarot","crocodylus-mindorensis","philippine-crocodile","crocodylusmindorensis","philippinecrocodile"]}
{"id":31,"common_name":"Panay forest monitor lizard","scientific_name":"Varanus mabitang","all_names":["varanus mabitang","panay forest monitor lizard","varanus-mabitang","panay forest monitor-lizard","panay forest-monitor lizard","panay forest-monitor-lizard","panay-forest monitor lizard","panay-forest monitor-lizard","panay-forest-monitor lizard","panay-forest-monitor-lizard","varanusmabitang","panayforestmonitorlizard"]}
{"id":32,"common_name":"Luzon rufous hornbill,Kalaw","scientific_name":"Buceros hydrocorax","all_names":["buceros hydrocorax","luzon rufous hornbill","kalaw","buceros-hydrocorax","luzon rufous-hornbill","luzon-rufous hornbill","luzon-rufous-hornbill","buceroshydrocorax","luzonrufoushornbill"]}
{"id":33,"common_name":"Mindanao hornbill","scientific_name":"Penelopides affinis","all_names":["penelopides affinis","mindanao hornbill","penelopides-affinis","mindanao-hornbill","penelopidesaffinis","mindanaohornbill"]}
{"id":34,"common_name":"Spotted imperial pigeon,Balud","scientific_name":"Ducula carola","all_names":["ducula carola","spotted imperial pigeon","balud","ducula-carola","spotted imperial-pigeon","spotted-imperial pigeon","spotted-imperial-pigeon","duculacarola","spottedimperialpigeon"]}
{"id":35,"common_name":"Palawan peacock-pheasant,Tandikan","scientific_name":"Polyplectron napoleonis","all_names":["polyplectron napoleonis","palawan peacock-pheasant","tandikan","polyplectron-napoleonis","palawan peacock pheasant","palawan-peacock pheasant","palawan-peacock-pheasant","polyplectronnapoleonis","palawanpeacockpheasant"]}
{"id":36,"common_name":"Giant scops owl","scientific_name":"Otus gurneyi","all_names":["otus gurneyi","giant scops owl","otus-gurneyi","giant scops-owl","giant-scops owl","giant-scops-owl","otusgurneyi","giantscopsowl"]}
{"id":37,"common_name":"Philippine eagle-owl,Kuwago,Bukaw","scientific_name":"Bubo philippensis","all_names":["bubo philippensis","philippine eagle-owl","kuwago","bukaw","bubo-philippensis","philippine eagle owl","philippine-eagle owl","philippine-eagle-owl","bubophilippensis","philippineeagleowl"]}
{"id":38,"common_name":"Loggerhead turtle,Pawikan,Bulawon","scientific_name":"Caretta caretta","all_names":["caretta caretta","loggerhead turtle","pawikan","bulawon","caretta-caretta","loggerhead-turtle","carettacaretta","loggerheadturtle"]}
{"id":39,"common_name":"Spiny hill turtle","scientific_name":"Heosemys spinosa","all_names":["heosemys spinosa","spiny hill turtle","heosemys-spinosa","spiny hill-turtle","spiny-hill turtle","spiny-hill-turtle","heosemysspinosa","spinyhillturtle"]}
{"id":40,"common_name":"McGregor's pitviper","scientific_name":"Trimeresurus mcgregori","all_names":["trimeresurus mcgregori","mcgregor's pitviper","trimeresurus-mcgregori","mcgregor‘s pitviper","mcgregor’s pitviper","mcgregor´s pitviper","mcgregor s pitviper","mcgregors pitviper","mcgregor pitviper","mcgregor's-pitviper","mcgregor‘s-pitviper","mcgregor’s-pitviper","mcgregor´s-pitviper","mcgregor s-pitviper","mcgregors-pitviper","mcgregor-pitviper","trimeresurusmcgregori","mcgregorspitviper","mcgregorpitviper"]}
{"id":41,"common_name":"Southern Luzon giant cloud rat,Bugkun","scientific_name":"Phloeomys cumingi","all_names":["phloeomys cumingi","southern luzon giant cloud rat","bugkun","phloeomys-cumingi","southern luzon giant cloud-rat","southern luzon giant-cloud rat","southern luzon giant-cloud-rat","southern luzon-giant cloud rat","southern luzon-giant cloud-rat","southern luzon-giant-cloud rat","southern luzon-giant-cloud-rat","southern-luzon giant cloud rat","southern-luzon giant cloud-rat","southern-luzon giant-cloud rat","southern-luzon giant-cloud-rat","southern-luzon-giant cloud rat","southern-luzon-giant cloud-rat","southern-luzon-giant-cloud rat","southern-luzon-giant-cloud-rat","phloeomyscumingi","southernluzongiantcloudrat"]}
{"id":42,"common_name":"Palawan bearded pig","scientific_name":"Sus ahoenobarbus","all_names":["sus ahoenobarbus","palawan bearded pig","sus-ahoenobarbus","palawan bearded-pig","palawan-bearded pig","palawan-bearded-pig","susahoenobarbus","palawanbeardedpig"]}
{"id":43,"common_name":"Philippine warty pig,Baboy Damo","scientific_name":"Sus philippensis","all_names":["sus philippensis","philippine warty pig","baboy damo","sus-philippensis","philippine warty-pig","philippine-warty pig","philippine-warty-pig","baboy-damo","susphilippensis","philippinewartypig","baboydamo"]}
{"id":44,"common_name":"Balabac mouse deer,Pilandok","scientific_name":"Tragulus nigricans","all_names":["tragulus nigricans","balabac mouse deer","pilandok","tragulus-nigricans","balabac mouse-deer","balabac-mouse deer","balabac-mouse-deer","tragulusnigricans","balabacmousedeer"]}
{"id":45,"common_name":"Philippine hawk-eagle,Banog","scientific_name":"Nisaetus philippensis","all_names":["nisaetus philippensis","philippine hawk-eagle","banog","nisaetus-philippensis","philippine hawk eagle","philippine-hawk eagle","philippine-hawk-eagle","nisaetusphilippensis","philippinehawkeagle"]}
{"id":46,"common_name":"Philippine duck,Pato,Papan,Dumaras","scientific_name":"Anas luzonica","all_names":["anas luzonica","philippine duck","pato","papan","dumaras","anas-luzonica","philippine-duck","anasluzonica","philippineduck"]}
{"id":47,"common_name":"Luzon bleeding-heart,Puñalada","scientific_name":"Gallicolumba luzonica","all_names":["gallicolumba luzonica","luzon bleeding-heart","puñalada","gallicolumba-luzonica","luzon bleeding heart","luzon-bleeding heart","luzon-bleeding-heart","gallicolumbaluzonica","luzonbleedingheart"]}
{"id":48,"common_name":"Mindanao bleeding-heart,Mukid","scientific_name":"Gallicolumba crinigera","all_names":["gallicolumba crinigera","mindanao bleeding-heart","mukid","gallicolumba-crinigera","mindanao bleeding heart","mindanao-bleeding heart","mindanao-bleeding-heart","gallicolumbacrinigera","mindanaobleedingheart"]}
{"id":49,"common_name":"Philippine green pigeon,Punay","scientific_name":"Treron axillaris","all_names":["treron axillaris","philippine green pigeon","punay","treron-axillaris","philippine green-pigeon","philippine-green pigeon","philippine-green-pigeon","treronaxillaris","philippinegreenpigeon"]}
{"id":50,"common_name":"Mindanao lorikeet,Kusi","scientific_name":"Trichoglossus johnstoniae","all_names":["trichoglossus johnstoniae","mindanao lorikeet","kusi","trichoglossus-johnstoniae","mindanao-lorikeet","trichoglossusjohnstoniae","mindanaolorikeet"]}
{"id":51,"common_name":"Blue-headed racket-tail,Kinawihan,Kilit","scientific_name":"Prioniturus platenae","all_names":["prioniturus platenae","blue-headed racket-tail","kinawihan","kilit","prioniturus-platenae","blue headed racket tail","blue headed racket-tail","blue headed-racket tail","blue headed-racket-tail","blue-headed racket tail","blue-headed-racket tail","blue-headed-racket-tail","prioniturusplatenae","blueheadedrackettail"]}
{"id":52,"common_name":"Marbled crested lizard,Marbled bloodsucker","scientific_name":"Bronchocela marmorata","all_names":["bronchocela marmorata","marbled crested lizard","marbled bloodsucker","bronchocela-marmorata","marbled crested-lizard","marbled-crested lizard","marbled-crested-lizard","marbled-bloodsucker","bronchocelamarmorata","marbledcrestedlizard","marbledbloodsucker"]}
{"id":53,"common_name":"Philippine blunt-headed tree snake","scientific_name":"Boiga angulata","all_names":["boiga angulata","philippine blunt-headed tree snake","boiga-angulata","philippine blunt headed tree snake","philippine blunt headed tree-snake","philippine blunt headed-tree snake","philippine blunt headed-tree-snake","philippine blunt-headed tree-snake","philippine blunt-headed-tree snake","philippine blunt-headed-tree-snake","philippine-blunt headed tree snake","philippine-blunt headed tree-snake","philippine-blunt headed-tree snake","philippine-blunt headed-tree-snake","philippine-blunt-headed tree snake","philippine-blunt-headed tree-snake","philippine-blunt-headed-tree snake","philippine-blunt-headed-tree-snake","boigaangulata","philippinebluntheadedtreesnake"]}
{"id":54,"common_name":"Dog-toothed tree snake","scientific_name":"Boiga cynodon","all_names":["boiga cynodon","dog-toothed tree snake","boiga-cynodon","dog toothed tree snake","dog toothed tree-snake","dog toothed-tree snake","dog toothed-tree-snake","dog-toothed tree-snake","dog-toothed-tree snake","dog-toothed-tree-snake","boigacynodon","dogtoothedtreesnake"]}
{"id":55,"common_name":"Mangrove Blunt-headed Tree Snake","scientific_name":"Boiga dendrophila","all_names":["boiga dendrophila","mangrove blunt-headed tree snake","boiga-dendrophila","mangrove blunt headed tree snake","mangrove blunt headed tree-snake","mangrove blunt headed-tree snake","mangrove blunt headed-tree-snake","mangrove blunt-headed tree-snake","mangrove blunt-headed-tree snake","mangrove blunt-headed-tree-snake","mangrove-blunt headed tree snake","mangrove-blunt headed tree-snake","mangrove-blunt headed-tree snake","mangrove-blunt headed-tree-snake","mangrove-blunt-headed tree snake","mangrove-blunt-headed tree-snake","mangrove-blunt-headed-tree snake","mangrove-blunt-headed-tree-snake","boigadendrophila","mangrovebluntheadedtreesnake"]}
{"id":56,"common_name":"Philippine red-tailed rat snake","scientific_name":"Coelognathus erythrurus","all_names":["coelognathus erythrurus","philippine red-tailed rat snake","coelognathus-erythrurus","philippine red tailed rat snake","philippine red tailed rat-snake","philippine red tailed-rat snake","philippine red tailed-rat-snake","philippine red-tailed rat-snake","philippine red-tailed-rat snake","philippine red-tailed-rat-snake","philippine-red tailed rat snake","philippine-red tailed rat-snake","philippine-red tailed-rat snake","philippine-red tailed-rat-snake","philippine-red-tailed rat snake","philippine-red-tailed rat-snake","philippine-red-tailed-rat snake","philippine-red-tailed-rat-snake","coelognathuserythrurus","philippineredtailedratsnake"]}
{"id":57,"common_name":"Reticulated python,Sawa,Biklat","scientific_name":"Malayopython reticulatus","all_names":["malayopython reticulatus","reticulated python","sawa","biklat","malayopython-reticulatus","reticulated-python","malayopythonreticulatus","reticulatedpython"]}
{"id":58,"common_name":"Spiny waterside skink,Crocodile Skink","scientific_name":"Tropidophorus grayi","all_names":["tropidophorus grayi","spiny waterside skink","crocodile skink","tropidophorus-grayi","spiny waterside-skink","spiny-waterside skink","spiny-waterside-skink","crocodile-skink","tropidophorusgrayi","spinywatersideskink","crocodileskink"]}
{"id":59,"common_name":"Enteng's monitor lizard","scientific_name":"Varanus dalubhasa","all_names":["varanus dalubhasa","enteng's monitor lizard","varanus-dalubhasa","enteng‘s monitor lizard","enteng’s monitor lizard","enteng´s monitor lizard","enteng s monitor lizard","entengs monitor lizard","enteng monitor lizard","enteng's monitor-lizard","enteng‘s monitor-lizard","enteng’s monitor-lizard","enteng´s monitor-lizard","enteng s monitor-lizard","entengs monitor-lizard","enteng monitor-lizard","enteng's-monitor lizard","enteng‘s-monitor lizard","enteng’s-monitor lizard","enteng´s-monitor lizard","enteng s-monitor lizard","entengs-monitor lizard","enteng-monitor lizard","enteng's-monitor-lizard","enteng‘s-monitor-lizard","enteng’s-monitor-lizard","enteng´s-monitor-lizard","enteng s-monitor-lizard","entengs-monitor-lizard","enteng-monitor-lizard","varanusdalubhasa","entengsmonitorlizard","entengmonitorlizard"]}
{"id":60,"common_name":"Samar monitor lizard","scientific_name":"Varanus samarensis","all_names":["varanus samarensis","samar monitor lizard","varanus-samarensis","samar monitor-lizard","samar-monitor lizard","samar-monitor-lizard","varanussamarensis","samarmonitorlizard"]}
{"id":61,"common_name":"Southern Philippine temple pit viper","scientific_name":"Tropidolaemus philippensis","all_names":["tropidolaemus philippensis","southern philippine temple pit viper","tropidolaemus-philippensis","southern philippine temple pit-viper","southern philippine temple-pit viper","southern philippine temple-pit-viper","southern philippine-temple pit viper","southern philippine-temple pit-viper","southern philippine-temple-pit viper","southern philippine-temple-pit-viper","southern-philippine temple pit viper","southern-philippine temple pit-viper","southern-philippine temple-pit viper","southern-philippine temple-pit-viper","southern-philippine-temple pit viper","southern-philippine-temple pit-viper","southern-philippine-temple-pit viper","southern-philippine-temple-pit-viper","tropidolaemusphilippensis","southernphilippinetemplepitviper"]}
{"id":62,"common_name":"Hill Myna,Kiyaw","scientific_name":"Gracula religiosa","all_names":["gracula religiosa","hill myna","kiyaw","gracula-religiosa","hill-myna","graculareligiosa","hillmyna"]}
{"id":63,"common_name":"","scientific_name":"Amesiella monticola","all_names":["amesiella monticola","amesiella-monticola","amesiellamonticola"]}
{"id":64,"common_name":"","scientific_name":"Bulbophyllum cootesii","all_names":["bulbophyllum cootesii","bulbophyllum-cootesii","bulbophyllumcootesii"]}
{"id":65,"common_name":"","scientific_name":"Ceratocentron fesselii","all_names":["ceratocentron fesselii","ceratocentron-fesselii","ceratocentronfesselii"]}
{"id":66,"common_name":"","scientific_name":"Dendrobium schuetzei","all_names":["dendrobium schuetzei","dendrobium-schuetzei","dendrobiumschuetzei"]}
{"id":67,"common_name":"","scientific_name":"Grammatophyllum ravanii","all_names":["grammatophyllum ravanii","grammatophyllum-ravanii","grammatophyllumravanii"]}
{"id":68,"common_name":"","scientific_name":"Grammatophyllum wallisii","all_names":["grammatophyllum wallisii","grammatophyllum-wallisii","grammatophyllumwallisii"]}
{"id":69,"common_name":"","scientific_name":"Phalaenopsis micholitzii","all_names":["phalaenopsis micholitzii","phalaenopsis-micholitzii","phalaenopsismicholitzii"]}
{"id":70,"common_name":"Waling-waling","scientific_name":"Vanda sanderiana","all_names":["vanda sanderiana","waling-waling","vanda-sanderiana","waling waling","vandasanderiana","walingwaling"]}
{"id":71,"common_name":"","scientific_name":"Nepenthes merrilliana","all_names":["nepenthes merrilliana","nepenthes-merrilliana","nepenthesmerrilliana"]}
{"id":72,"common_name":"staghorn fern","scientific_name":"Platycerium coronarium","all_names":["platycerium coronarium","staghorn fern","platycerium-coronarium","staghorn-fern","platyceriumcoronarium","staghornfern"]}
{"id":73,"common_name":"giant staghorn fern","scientific_name":"Platycerium grande","all_names":["platycerium grande","giant staghorn fern","platycerium-grande","giant staghorn-fern","giant-staghorn fern","giant-staghorn-fern","platyceriumgrande","giantstaghornfern"]}
{"id":74,"common_name":"kapa-kapa","scientific_name":"Medinilla magnifica","all_names":["medinilla magnifica","kapa-kapa","medinilla-magnifica","kapa kapa","medinillamagnifica","kapakapa"]}
{"id":75,"common_name":"Sander's alocasia","scientific_name":"Alocasia sanderiana","all_names":["alocasia sanderiana","sander's alocasia","alocasia-sanderiana","sander‘s alocasia","sander’s alocasia","sander´s alocasia","sander s alocasia","sanders alocasia","sander alocasia","sander's-alocasia","sander‘s-alocasia","sander’s-alocasia","sander´s-alocasia","sander s-alocasia","sanders-alocasia","sander-alocasia","alocasiasanderiana","sandersalocasia","sanderalocasia"]}
{"id":76,"common_name":"","scientific_name":"Hoya wayetii","all_names":["hoya wayetii","hoya-wayetii","hoyawayetii"]}
{"id":77,"common_name":"","scientific_name":"Aerides lawrenciae","all_names":["aerides lawrenciae","aerides-lawrenciae","aerideslawrenciae"]}
{"id":78,"common_name":"","scientific_name":"Amesiella philippinensis","all_names":["amesiella philippinensis","amesiella-philippinensis","amesiellaphilippinensis"]}
{"id":79,"common_name":"","scientific_name":"Bulbophyllum facetum","all_names":["bulbophyllum facetum","bulbophyllum-facetum","bulbophyllumfacetum"]}
{"id":80,"common_name":"","scientific_name":"Bulbophyllum nymphopolitanum","all_names":["bulbophyllum nymphopolitanum","bulbophyllum-nymphopolitanum","bulbophyllumnymphopolitanum"]}
{"id":81,"common_name":"","scientific_name":"Bulbophyllum piestoglossum","all_names":["bulbophyllum piestoglossum","bulbophyllum-piestoglossum","bulbophyllumpiestoglossum"]}
{"id":82,"common_name":"","scientific_name":"Bulbophyllum stellatum","all_names":["bulbophyllum stellatum","bulbophyllum-stellatum","bulbophyllumstellatum"]}
{"id":83,"common_name":"","scientific_name":"Coelogyne confusa","all_names":["coelogyne confusa","coelogyne-confusa","coelogyneconfusa"]}
{"id":84,"common_name":"","scientific_name":"Dendrobium bullenianum","all_names":["dendrobium bullenianum","dendrobium-bullenianum","dendrobiumbullenianum"]}
{"id":85,"common_name":"","scientific_name":"Grammatophyllum martae","all_names":["grammatophyllum martae","grammatophyllum-martae","grammatophyllummartae"]}
{"id":86,"common_name":"","scientific_name":"Phalaenopsis hieroglyphica","all_names":["phalaenopsis hieroglyphica","phalaenopsis-hieroglyphica","phalaenopsishieroglyphica"]}
{"id":87,"common_name":"","scientific_name":"Phalaenopsis lindenii","all_names":["phalaenopsis lindenii","phalaenopsis-lindenii","phalaenopsislindenii"]}
{"id":88,"common_name":"","scientific_name":"Phalaenopsis lueddemanniana","all_names":["phalaenopsis lueddemanniana","phalaenopsis-lueddemanniana","phalaenopsislueddemanniana"]}
{"id":89,"common_name":"","scientific_name":"Phalaenopsis pallens","all_names":["phalaenopsis pallens","phalaenopsis-pallens","phalaenopsispallens"]}
{"id":90,"common_name":"","scientific_name":"Phalaenopsis pulchra","all_names":["phalaenopsis pulchra","phalaenopsis-pulchra","phalaenopsispulchra"]}
{"id":91,"common_name":"","scientific_name":"Phalaenopsis reichenbachiana","all_names":["phalaenopsis reichenbachiana","phalaenopsis-reichenbachiana","phalaenopsisreichenbachiana"]}
{"id":92,"common_name":"","scientific_name":"Phalaenopsis sanderiana","all_names":["phalaenopsis sanderiana","phalaenopsis-sanderiana","phalaenopsissanderiana"]}
{"id":93,"common_name":"","scientific_name":"Phalaenopsis schilleriana","all_names":["phalaenopsis schilleriana","phalaenopsis-schilleriana","phalaenopsisschilleriana"]}
{"id":94,"common_name":"","scientific_name":"Renanthera monachica","all_names":["renanthera monachica","renanthera-monachica","renantheramonachica"]}
{"id":95,"common_name":"","scientific_name":"Renanthera philippinensis","all_names":["renanthera philippinensis","renanthera-philippinensis","renantheraphilippinensis"]}
{"id":96,"common_name":"","scientific_name":"Renanthera storiei","all_names":["renanthera storiei","renanthera-storiei","renantherastoriei"]}
{"id":97,"common_name":"","scientific_name":"Staurochilus leytensis,Trichoglottis fasciata","all_names":["staurochilus leytensis","trichoglottis fasciata","staurochilus-leytensis","trichoglottis-fasciata","staurochilusleytensis","trichoglottisfasciata"]}
{"id":98,"common_name":"","scientific_name":"Trichoglottis loheriana","all_names":["trichoglottis loheriana","trichoglottis-loheriana","trichoglottisloheriana"]}
{"id":99,"common_name":"","scientific_name":"Trichoglottis luzonensis","all_names":["trichoglottis luzonensis","trichoglottis-luzonensis","trichoglottisluzonensis"]}
{"id":100,"common_name":"","scientific_name":"Vanda javierae","all_names":["vanda javierae","vanda-javierae","vandajavierae"]}
{"id":101,"common_name":"","scientific_name":"Vanda luzonica","all_names":["vanda luzonica","vanda-luzonica","vandaluzonica"]}
{"id":102,"common_name":"","scientific_name":"Vanda merrillii","all_names":["vanda merrillii","vanda-merrillii","vandamerrillii"]}
{"id":103,"common_name":"","scientific_name":"Nepenthes burkei","all_names":["nepenthes burkei","nepenthes-burkei","nepenthesburkei"]}
{"id":104,"common_name":"Sandaoua","scientific_name":"Nepenthes truncata","all_names":["nepenthes truncata","sandaoua","nepenthes-truncata","nepenthestruncata"]}
{"id":105,"common_name":"Kako","scientific_name":"Nepenthes ventricosa","all_names":["nepenthes ventricosa","kako","nepenthes-ventricosa","nepenthesventricosa"]}
{"id":106,"common_name":"Dainsuli","scientific_name":"Hedychium philippinense","all_names":["hedychium philippinense","dainsuli","hedychium-philippinense","hedychiumphilippinense"]}
{"id":107,"common_name":"tayabak,jade vine","scientific_name":"Strongylodon macrobotrys","all_names":["strongylodon macrobotrys","tayabak","jade vine","strongylodon-macrobotrys","jade-vine","strongylodonmacrobotrys","jadevine"]}
{"id":108,"common_name":"Lalanug","scientific_name":"Medinilla stenobotrys","all_names":["medinilla stenobotrys","lalanug","medinilla-stenobotrys","medinillastenobotrys"]}
{"id":109,"common_name":"","scientific_name":"Alocasia micholitziana","all_names":["alocasia micholitziana","alocasia-micholitziana","alocasiamicholitziana"]}
{"id":110,"common_name":"Badiang","scientific_name":"Alocasia zebrina","all_names":["alocasia zebrina","badiang","alocasia-zebrina","alocasiazebrina"]}
{"id":111,"common_name":"","scientific_name":"Hoya meliflua","all_names":["hoya meliflua","hoya-meliflua","hoyameliflua"]}
{"id":112,"common_name":"","scientific_name":"Aerides leeana","all_names":["aerides leeana","aerides-leeana","aeridesleeana"]}
{"id":113,"common_name":"","scientific_name":"Aerides quinquevulnera","all_names":["aerides quinquevulnera","aerides-quinquevulnera","aeridesquinquevulnera"]}
{"id":114,"common_name":"","scientific_name":"Bulbophyllum papulosum","all_names":["bulbophyllum papulosum","bulbophyllum-papulosum","bulbophyllumpapulosum"]}
{"id":115,"common_name":"","scientific_name":"Dendrobium nemorale","all_names":["dendrobium nemorale","dendrobium-nemorale","dendrobiumnemorale"]}
{"id":116,"common_name":"","scientific_name":"Dendrobium sanderae","all_names":["dendrobium sanderae","dendrobium-sanderae","dendrobiumsanderae"]}
{"id":117,"common_name":"","scientific_name":"Dendrobium victoriae-reginae","all_names":["dendrobium victoriae-reginae","dendrobium victoriae reginae","dendrobium-victoriae reginae","dendrobium-victoriae-reginae","dendrobiumvictoriaereginae"]}
{"id":118,"common_name":"","scientific_name":"Dendrobium secundum","all_names":["dendrobium secundum","dendrobium-secundum","dendrobiumsecundum"]}
{"id":119,"common_name":"rosa mia","scientific_name":"Grammatophyllum multiflorum","all_names":["grammatophyllum multiflorum","rosa mia","grammatophyllum-multiflorum","rosa-mia","grammatophyllummultiflorum","rosamia"]}
{"id":120,"common_name":"","scientific_name":"Phalaenopsis bastianii","all_names":["phalaenopsis bastianii","phalaenopsis-bastianii","phalaenopsisbastianii"]}
{"id":121,"common_name":"","scientific_name":"Phalaenopsis equestris","all_names":["phalaenopsis equestris","phalaenopsis-equestris","phalaenopsisequestris"]}
{"id":122,"common_name":"","scientific_name":"Phalaenopsis fasciata","all_names":["phalaenopsis fasciata","phalaenopsis-fasciata","phalaenopsisfasciata"]}
{"id":123,"common_name":"","scientific_name":"Nepenthes cornuta","all_names":["nepenthes cornuta","nepenthes-cornuta","nepenthescornuta"]}
{"id":124,"common_name":"","scientific_name":"Nepenthes hamiguitanensis","all_names":["nepenthes hamiguitanensis","nepenthes-hamiguitanensis","nepentheshamiguitanensis"]}
{"id":125,"common_name":"","scientific_name":"Nepenthes mindanaoensis","all_names":["nepenthes mindanaoensis","nepenthes-mindanaoensis","nepenthesmindanaoensis"]}
{"id":126,"common_name":"","scientific_name":"Nepenthes pantaronensis","all_names":["nepenthes pantaronensis","nepenthes-pantaronensis","nepenthespantaronensis"]}
{"id":127,"common_name":"","scientific_name":"Nepenthes talaandig","all_names":["nepenthes talaandig","nepenthes-talaandig","nepenthestalaandig"]}
{"id":128,"common_name":"Bindanugan","scientific_name":"Strongylodon elmeri","all_names":["strongylodon elmeri","bindanugan","strongylodon-elmeri","strongylodonelmeri"]}
{"id":129,"common_name":"","scientific_name":"Begonia lagunensis","all_names":["begonia lagunensis","begonia-lagunensis","begonialagunensis"]}
{"id":130,"common_name":"","scientific_name":"Paphiopedilum acmodontum","all_names":["paphiopedilum acmodontum","paphiopedilum-acmodontum","paphiopedilumacmodontum"]}
{"id":131,"common_name":"","scientific_name":"Paphiopedilum adductum","all_names":["paphiopedilum adductum","paphiopedilum-adductum","paphiopedilumadductum"]}
{"id":132,"common_name":"Argus paphiopedilum","scientific_name":"Paphiopedilum argus","all_names":["paphiopedilum argus","argus paphiopedilum","paphiopedilum-argus","argus-paphiopedilum","paphiopedilumargus","arguspaphiopedilum"]}
{"id":133,"common_name":"Short haired paphiopedilum","scientific_name":"Paphiopedilum ciliolare","all_names":["paphiopedilum ciliolare","short haired paphiopedilum","paphiopedilum-ciliolare","short haired-paphiopedilum","short-haired paphiopedilum","short-haired-paphiopedilum","paphiopedilumciliolare","shorthairedpaphiopedilum"]}
{"id":134,"common_name":"Fowlie's paphiopedilum","scientific_name":"Paphiopedilum fowliei","all_names":["paphiopedilum fowliei","fowlie's paphiopedilum","paphiopedilum-fowliei","fowlie‘s paphiopedilum","fowlie’s paphiopedilum","fowlie´s paphiopedilum","fowlie s paphiopedilum","fowlies paphiopedilum","fowlie paphiopedilum","fowlie's-paphiopedilum","fowlie‘s-paphiopedilum","fowlie’s-paphiopedilum","fowlie´s-paphiopedilum","fowlie s-paphiopedilum","fowlies-paphiopedilum","fowlie-paphiopedilum","paphiopedilumfowliei","fowliespaphiopedilum","fowliepaphiopedilum"]}
{"id":135,"common_name":"Haynald's paphiopedilum","scientific_name":"Paphiopedilum haynaldianum","all_names":["paphiopedilum haynaldianum","haynald's paphiopedilum","paphiopedilum-haynaldianum","haynald‘s paphiopedilum","haynald’s paphiopedilum","haynald´s paphiopedilum","haynald s paphiopedilum","haynalds paphiopedilum","haynald paphiopedilum","haynald's-paphiopedilum","haynald‘s-paphiopedilum","haynald’s-paphiopedilum","haynald´s-paphiopedilum","haynald s-paphiopedilum","haynalds-paphiopedilum","haynald-paphiopedilum","paphiopedilumhaynaldianum","haynaldspaphiopedilum","haynaldpaphiopedilum"]}
{"id":136,"common_name":"Hennis' paphiopedilum","scientific_name":"Paphiopedilum hennisianum","all_names":["paphiopedilum hennisianum","hennis' paphiopedilum","paphiopedilum-hennisianum","hennis‘ paphiopedilum","hennis’ paphiopedilum","hennis´ paphiopedilum","hennis  paphiopedilum","hennis paphiopedilum","hennis' paphiopedilum","hennis'-paphiopedilum","hennis‘-paphiopedilum","hennis’-paphiopedilum","hennis´-paphiopedilum","hennis -paphiopedilum","hennis-paphiopedilum","hennis'-paphiopedilum","paphiopedilumhennisianum","hennispaphiopedilum","hennis'paphiopedilum"]}
{"id":137,"common_name":"Philippine paphiopedilum","scientific_name":"Paphiopedilum philippinense","all_names":["paphiopedilum philippinense","philippine paphiopedilum","paphiopedilum-philippinense","philippine-paphiopedilum","paphiopedilumphilippinense","philippinepaphiopedilum"]}
{"id":138,"common_name":"Rands' paphiopedilum","scientific_name":"Paphiopedilum randsii","all_names":["paphiopedilum randsii","rands' paphiopedilum","paphiopedilum-randsii","rands‘ paphiopedilum","rands’ paphiopedilum","rands´ paphiopedilum","rands  paphiopedilum","rands paphiopedilum","rands' paphiopedilum","rands'-paphiopedilum","rands‘-paphiopedilum","rands’-paphiopedilum","rands´-paphiopedilum","rands -paphiopedilum","rands-paphiopedilum","rands'-paphiopedilum","paphiopedilumrandsii","randspaphiopedilum","rands'paphiopedilum"]}
{"id":139,"common_name":"Urban's paphiopedilum","scientific_name":"Paphiopedilum urbanianum","all_names":["paphiopedilum urbanianum","urban's paphiopedilum","paphiopedilum-urbanianum","urban‘s paphiopedilum","urban’s paphiopedilum","urban´s paphiopedilum","urban s paphiopedilum","urbans paphiopedilum","urban paphiopedilum","urban's-paphiopedilum","urban‘s-paphiopedilum","urban’s-paphiopedilum","urban´s-paphiopedilum","urban s-paphiopedilum","urbans-paphiopedilum","urban-paphiopedilum","paphiopedilumurbanianum","urbanspaphiopedilum","urbanpaphiopedilum"]}
{"id":140,"common_name":"","scientific_name":"Paphiopedilum usitanum,Paphiopedilum parnatanum","all_names":["paphiopedilum usitanum","paphiopedilum parnatanum","paphiopedilum-usitanum","paphiopedilum-parnatanum","paphiopedilumusitanum","paphiopedilumparnatanum"]}
{"id":141,"common_name":"Bearded paphiopedilum","scientific_name":"Paphiopedilum barbatum","all_names":["paphiopedilum barbatum","bearded paphiopedilum","paphiopedilum-barbatum","bearded-paphiopedilum","paphiopedilumbarbatum","beardedpaphiopedilum"]}
{"id":142,"common_name":"Low's paphiopedilum","scientific_name":"Paphiopedilum lowii","all_names":["paphiopedilum lowii","low's paphiopedilum","paphiopedilum-lowii","low‘s paphiopedilum","low’s paphiopedilum","low´s paphiopedilum","low s paphiopedilum","lows paphiopedilum","low paphiopedilum","low's-paphiopedilum","low‘s-paphiopedilum","low’s-paphiopedilum","low´s-paphiopedilum","low s-paphiopedilum","lows-paphiopedilum","low-paphiopedilum","paphiopedilumlowii","lowspaphiopedilum","lowpaphiopedilum"]}
{"id":143,"common_name":"","scientific_name":"Nepenthes bellii","all_names":["nepenthes bellii","nepenthes-bellii","nepenthesbellii"]}
{"id":144,"common_name":"","scientific_name":"Nepenthes ceciliae","all_names":["nepenthes ceciliae","nepenthes-ceciliae","nepenthesceciliae"]}
{"id":145,"common_name":"","scientific_name":"Nepenthes copelandii,Nepenthes alata","all_names":["nepenthes copelandii","nepenthes alata","nepenthes-copelandii","nepenthes-alata","nepenthescopelandii","nepenthesalata"]}
{"id":146,"common_name":"","scientific_name":"Nepenthes gantungensis,Nepenthes deaniana","all_names":["nepenthes gantungensis","nepenthes deaniana","nepenthes-gantungensis","nepenthes-deaniana","nepenthesgantungensis","nepenthesdeaniana"]}
{"id":147,"common_name":"","scientific_name":"Nepenthes mantalingajanensis","all_names":["nepenthes mantalingajanensis","nepenthes-mantalingajanensis","nepenthesmantalingajanensis"]}
{"id":148,"common_name":"","scientific_name":"Nepenthes petiolata","all_names":["nepenthes petiolata","nepenthes-petiolata","nepenthespetiolata"]}
{"id":149,"common_name":"Kuong-kuong","scientific_name":"Nepenthes philippinensis","all_names":["nepenthes philippinensis","kuong-kuong","nepenthes-philippinensis","kuong kuong","nepenthesphilippinensis","kuongkuong"]}
{"id":150,"common_name":"","scientific_name":"Nepenthes saranganiensis","all_names":["nepenthes saranganiensis","nepenthes-saranganiensis","nepenthessaranganiensis"]}
{"id":151,"common_name":"","scientific_name":"Nepenthes sumagaya","all_names":["nepenthes sumagaya","nepenthes-sumagaya","nepenthessumagaya"]}
{"id":152,"common_name":"","scientific_name":"Nepenthes surigaoensis","all_names":["nepenthes surigaoensis","nepenthes-surigaoensis","nepenthessurigaoensis"]}
{"id":153,"common_name":"","scientific_name":"Nepenthes ultra","all_names":["nepenthes ultra","nepenthes-ultra","nepenthesultra"]}
{"id":154,"common_name":"","scientific_name":"Nepenthes viridis","all_names":["nepenthes viridis","nepenthes-viridis","nepenthesviridis"]}
{"id":155,"common_name":"bantigi","scientific_name":"Pemphis acidula","all_names":["pemphis acidula","bantigi","pemphis-acidula","pemphisacidula"]}
{"id":156,"common_name":"agarwood,bari","scientific_name":"Aquilaria malaccensis","all_names":["aquilaria malaccensis","agarwood","bari","aquilaria-malaccensis","aquilariamalaccensis"]}
{"id":157,"common_name":"Swiftlet,balinsasayaw","scientific_name":"Collocalia spp","all_names":["collocalia spp","swiftlet","balinsasayaw","collocalia-spp","collocaliaspp"]}
{"id":158,"common_name":"exoticpets","scientific_name":"exoticpets","all_names":["exoticpets"]}
