{
  "db": {
    "name": "db",
    "connector": "memory"
  },
  "mysqlDs": {
    "host": "demo.strongloop.com",
    "port": 3306,
    "database": "getting_started_intermediate",
    "username": "demo",
    "password": "L00pBack",
    "name": "mysqlDs",
    "connector": "mysql"
  },
  "mongoDs": {
    
    "url": "mongodb://hai:123456@ds137720.mlab.com:37720/demonodejs",
    "name": "mongoDs",
    "connector": "loopback-connector-mongodb"
  }
}
