{
  "AWSTemplateFormatVersion": "2010-09-09",
  "Description": "The AWS CloudFormation template for this Serverless application",
  "Resources": {
    "ServerlessDeploymentBucket": {
      "Type": "AWS::S3::Bucket",
      "Properties": {
        "BucketEncryption": {
          "ServerSideEncryptionConfiguration": [
            {
              "ServerSideEncryptionByDefault": {
                "SSEAlgorithm": "AES256"
              }
            }
          ]
        }
      }
    },
    "ServerlessDeploymentBucketPolicy": {
      "Type": "AWS::S3::BucketPolicy",
      "Properties": {
        "Bucket": {
          "Ref": "ServerlessDeploymentBucket"
        },
        "PolicyDocument": {
          "Statement": [
            {
              "Action": "s3:*",
              "Effect": "Deny",
              "Principal": "*",
              "Resource": [
                {
                  "Fn::Join": [
                    "",
                    [
                      "arn:",
                      {
                        "Ref": "AWS::Partition"
                      },
                      ":s3:::",
                      {
                        "Ref": "ServerlessDeploymentBucket"
                      },
                      "/*"
                    ]
                  ]
                },
                {
                  "Fn::Join": [
                    "",
                    [
                      "arn:",
                      {
                        "Ref": "AWS::Partition"
                      },
                      ":s3:::",
                      {
                        "Ref": "ServerlessDeploymentBucket"
                      }
                    ]
                  ]
                }
              ],
              "Condition": {
                "Bool": {
                  "aws:SecureTransport": false
                }
              }
            }
          ]
        }
      }
    },
    "GetUnderscorehsUnderscorecontactLogGroup": {
      "Type": "AWS::Logs::LogGroup",
      "Properties": {
        "LogGroupName": "/aws/lambda/hubspot-synchronisator-v1-get_hs_contact"
      }
    },
    "UpdateUnderscorehsUnderscorecontactLogGroup": {
      "Type": "AWS::Logs::LogGroup",
      "Properties": {
        "LogGroupName": "/aws/lambda/hubspot-synchronisator-v1-update_hs_contact"
      }
    },
    "CreateUnderscorehsUnderscorecontactLogGroup": {
      "Type": "AWS::Logs::LogGroup",
      "Properties": {
        "LogGroupName": "/aws/lambda/hubspot-synchronisator-v1-create_hs_contact"
      }
    },
    "CreateUnderscores3UnderscorecontactLogGroup": {
      "Type": "AWS::Logs::LogGroup",
      "Properties": {
        "LogGroupName": "/aws/lambda/hubspot-synchronisator-v1-create_s3_contact"
      }
    },
    "IamRoleLambdaExecution": {
      "Type": "AWS::IAM::Role",
      "Properties": {
        "AssumeRolePolicyDocument": {
          "Version": "2012-10-17",
          "Statement": [
            {
              "Effect": "Allow",
              "Principal": {
                "Service": [
                  "lambda.amazonaws.com"
                ]
              },
              "Action": [
                "sts:AssumeRole"
              ]
            }
          ]
        },
        "Policies": [
          {
            "PolicyName": {
              "Fn::Join": [
                "-",
                [
                  "hubspot-synchronisator",
                  "v1",
                  "lambda"
                ]
              ]
            },
            "PolicyDocument": {
              "Version": "2012-10-17",
              "Statement": [
                {
                  "Effect": "Allow",
                  "Action": [
                    "logs:CreateLogStream",
                    "logs:CreateLogGroup"
                  ],
                  "Resource": [
                    {
                      "Fn::Sub": "arn:${AWS::Partition}:logs:${AWS::Region}:${AWS::AccountId}:log-group:/aws/lambda/hubspot-synchronisator-v1*:*"
                    }
                  ]
                },
                {
                  "Effect": "Allow",
                  "Action": [
                    "logs:PutLogEvents"
                  ],
                  "Resource": [
                    {
                      "Fn::Sub": "arn:${AWS::Partition}:logs:${AWS::Region}:${AWS::AccountId}:log-group:/aws/lambda/hubspot-synchronisator-v1*:*:*"
                    }
                  ]
                }
              ]
            }
          }
        ],
        "Path": "/",
        "RoleName": {
          "Fn::Join": [
            "-",
            [
              "hubspot-synchronisator",
              "v1",
              {
                "Ref": "AWS::Region"
              },
              "lambdaRole"
            ]
          ]
        }
      }
    },
    "GetUnderscorehsUnderscorecontactLambdaFunction": {
      "Type": "AWS::Lambda::Function",
      "Properties": {
        "Code": {
          "S3Bucket": {
            "Ref": "ServerlessDeploymentBucket"
          },
          "S3Key": "serverless/hubspot-synchronisator/v1/1639126664177-2021-12-10T08:57:44.177Z/hubspot-synchronisator.zip"
        },
        "Handler": "services/contact/get_hs_contact.get_hs_contact",
        "Runtime": "nodejs12.x",
        "FunctionName": "hubspot-synchronisator-v1-get_hs_contact",
        "MemorySize": 1024,
        "Timeout": 15,
        "Role": {
          "Fn::GetAtt": [
            "IamRoleLambdaExecution",
            "Arn"
          ]
        }
      },
      "DependsOn": [
        "GetUnderscorehsUnderscorecontactLogGroup"
      ]
    },
    "UpdateUnderscorehsUnderscorecontactLambdaFunction": {
      "Type": "AWS::Lambda::Function",
      "Properties": {
        "Code": {
          "S3Bucket": {
            "Ref": "ServerlessDeploymentBucket"
          },
          "S3Key": "serverless/hubspot-synchronisator/v1/1639126664177-2021-12-10T08:57:44.177Z/hubspot-synchronisator.zip"
        },
        "Handler": "services/contact/update_hs_contact.update_hs_contact",
        "Runtime": "nodejs12.x",
        "FunctionName": "hubspot-synchronisator-v1-update_hs_contact",
        "MemorySize": 1024,
        "Timeout": 15,
        "Role": {
          "Fn::GetAtt": [
            "IamRoleLambdaExecution",
            "Arn"
          ]
        }
      },
      "DependsOn": [
        "UpdateUnderscorehsUnderscorecontactLogGroup"
      ]
    },
    "CreateUnderscorehsUnderscorecontactLambdaFunction": {
      "Type": "AWS::Lambda::Function",
      "Properties": {
        "Code": {
          "S3Bucket": {
            "Ref": "ServerlessDeploymentBucket"
          },
          "S3Key": "serverless/hubspot-synchronisator/v1/1639126664177-2021-12-10T08:57:44.177Z/hubspot-synchronisator.zip"
        },
        "Handler": "services/contact/create_hs_contact.create_hs_contact",
        "Runtime": "nodejs12.x",
        "FunctionName": "hubspot-synchronisator-v1-create_hs_contact",
        "MemorySize": 1024,
        "Timeout": 15,
        "Role": {
          "Fn::GetAtt": [
            "IamRoleLambdaExecution",
            "Arn"
          ]
        }
      },
      "DependsOn": [
        "CreateUnderscorehsUnderscorecontactLogGroup"
      ]
    },
    "CreateUnderscores3UnderscorecontactLambdaFunction": {
      "Type": "AWS::Lambda::Function",
      "Properties": {
        "Code": {
          "S3Bucket": {
            "Ref": "ServerlessDeploymentBucket"
          },
          "S3Key": "serverless/hubspot-synchronisator/v1/1639126664177-2021-12-10T08:57:44.177Z/hubspot-synchronisator.zip"
        },
        "Handler": "services/contact/create_s3_contact.create_s3_contact",
        "Runtime": "nodejs12.x",
        "FunctionName": "hubspot-synchronisator-v1-create_s3_contact",
        "MemorySize": 1024,
        "Timeout": 15,
        "Role": {
          "Fn::GetAtt": [
            "IamRoleLambdaExecution",
            "Arn"
          ]
        }
      },
      "DependsOn": [
        "CreateUnderscores3UnderscorecontactLogGroup"
      ]
    },
    "GetUnderscorehsUnderscorecontactLambdaVersioni0O1yjvjQ4UY0b0HfvtXPuIgUkhGU6Kz9AJxk8g": {
      "Type": "AWS::Lambda::Version",
      "DeletionPolicy": "Retain",
      "Properties": {
        "FunctionName": {
          "Ref": "GetUnderscorehsUnderscorecontactLambdaFunction"
        },
        "CodeSha256": "6h7xE4VStqeadVulurcGoDyrEgn5aYdG4FknPuDMUuM="
      }
    },
    "UpdateUnderscorehsUnderscorecontactLambdaVersiony4MLB5gj9nGw5UYesRi0mZ01AxPq4WuVdlPbvSV1M0": {
      "Type": "AWS::Lambda::Version",
      "DeletionPolicy": "Retain",
      "Properties": {
        "FunctionName": {
          "Ref": "UpdateUnderscorehsUnderscorecontactLambdaFunction"
        },
        "CodeSha256": "6h7xE4VStqeadVulurcGoDyrEgn5aYdG4FknPuDMUuM="
      }
    },
    "CreateUnderscorehsUnderscorecontactLambdaVersionVwkuShfTQNFAaseESOE4yBgJW97hB7jKaO34JCd7c": {
      "Type": "AWS::Lambda::Version",
      "DeletionPolicy": "Retain",
      "Properties": {
        "FunctionName": {
          "Ref": "CreateUnderscorehsUnderscorecontactLambdaFunction"
        },
        "CodeSha256": "6h7xE4VStqeadVulurcGoDyrEgn5aYdG4FknPuDMUuM="
      }
    },
    "CreateUnderscores3UnderscorecontactLambdaVersionZHs8vNWZwwHNGmEhuyQAKkOerW6N1pXKin9kcl79soU": {
      "Type": "AWS::Lambda::Version",
      "DeletionPolicy": "Retain",
      "Properties": {
        "FunctionName": {
          "Ref": "CreateUnderscores3UnderscorecontactLambdaFunction"
        },
        "CodeSha256": "6h7xE4VStqeadVulurcGoDyrEgn5aYdG4FknPuDMUuM="
      }
    },
    "CreateUnderscoremdmUnderscorecontactUnderscoretoUnderscorehsUnderscorestateUnderscoremachineRole": {
      "Type": "AWS::IAM::Role",
      "Properties": {
        "AssumeRolePolicyDocument": {
          "Version": "2012-10-17",
          "Statement": [
            {
              "Effect": "Allow",
              "Principal": {
                "Service": "states.eu-west-3.amazonaws.com"
              },
              "Action": "sts:AssumeRole"
            }
          ]
        },
        "Policies": [
          {
            "PolicyName": "v1-eu-west-3-hubspot-synchronisator-statemachine",
            "PolicyDocument": {
              "Version": "2012-10-17",
              "Statement": [
                {
                  "Effect": "Allow",
                  "Action": [
                    "lambda:InvokeFunction"
                  ],
                  "Resource": [
                    {
                      "Fn::GetAtt": [
                        "GetUnderscorehsUnderscorecontactLambdaFunction",
                        "Arn"
                      ]
                    },
                    {
                      "Fn::Sub": [
                        "${functionArn}:*",
                        {
                          "functionArn": {
                            "Fn::GetAtt": [
                              "GetUnderscorehsUnderscorecontactLambdaFunction",
                              "Arn"
                            ]
                          }
                        }
                      ]
                    },
                    {
                      "Fn::GetAtt": [
                        "UpdateUnderscorehsUnderscorecontactLambdaFunction",
                        "Arn"
                      ]
                    },
                    {
                      "Fn::Sub": [
                        "${functionArn}:*",
                        {
                          "functionArn": {
                            "Fn::GetAtt": [
                              "UpdateUnderscorehsUnderscorecontactLambdaFunction",
                              "Arn"
                            ]
                          }
                        }
                      ]
                    },
                    {
                      "Fn::GetAtt": [
                        "CreateUnderscorehsUnderscorecontactLambdaFunction",
                        "Arn"
                      ]
                    },
                    {
                      "Fn::Sub": [
                        "${functionArn}:*",
                        {
                          "functionArn": {
                            "Fn::GetAtt": [
                              "CreateUnderscorehsUnderscorecontactLambdaFunction",
                              "Arn"
                            ]
                          }
                        }
                      ]
                    }
                  ]
                }
              ]
            }
          }
        ]
      }
    },
    "UpdateUnderscoremdmUnderscorecontactUnderscoreonUnderscorehsUnderscorestateUnderscoremachineRole": {
      "Type": "AWS::IAM::Role",
      "Properties": {
        "AssumeRolePolicyDocument": {
          "Version": "2012-10-17",
          "Statement": [
            {
              "Effect": "Allow",
              "Principal": {
                "Service": "states.eu-west-3.amazonaws.com"
              },
              "Action": "sts:AssumeRole"
            }
          ]
        },
        "Policies": [
          {
            "PolicyName": "v1-eu-west-3-hubspot-synchronisator-statemachine",
            "PolicyDocument": {
              "Version": "2012-10-17",
              "Statement": [
                {
                  "Effect": "Allow",
                  "Action": [
                    "lambda:InvokeFunction"
                  ],
                  "Resource": [
                    {
                      "Fn::GetAtt": [
                        "GetUnderscorehsUnderscorecontactLambdaFunction",
                        "Arn"
                      ]
                    },
                    {
                      "Fn::Sub": [
                        "${functionArn}:*",
                        {
                          "functionArn": {
                            "Fn::GetAtt": [
                              "GetUnderscorehsUnderscorecontactLambdaFunction",
                              "Arn"
                            ]
                          }
                        }
                      ]
                    },
                    {
                      "Fn::GetAtt": [
                        "UpdateUnderscorehsUnderscorecontactLambdaFunction",
                        "Arn"
                      ]
                    },
                    {
                      "Fn::Sub": [
                        "${functionArn}:*",
                        {
                          "functionArn": {
                            "Fn::GetAtt": [
                              "UpdateUnderscorehsUnderscorecontactLambdaFunction",
                              "Arn"
                            ]
                          }
                        }
                      ]
                    }
                  ]
                }
              ]
            }
          }
        ]
      }
    },
    "UpdateUnderscorehsUnderscorecontactUnderscoreonUnderscoremdmUnderscorestateUnderscoremachineRole": {
      "Type": "AWS::IAM::Role",
      "Properties": {
        "AssumeRolePolicyDocument": {
          "Version": "2012-10-17",
          "Statement": [
            {
              "Effect": "Allow",
              "Principal": {
                "Service": "states.eu-west-3.amazonaws.com"
              },
              "Action": "sts:AssumeRole"
            }
          ]
        },
        "Policies": [
          {
            "PolicyName": "v1-eu-west-3-hubspot-synchronisator-statemachine",
            "PolicyDocument": {
              "Version": "2012-10-17",
              "Statement": [
                {
                  "Effect": "Allow",
                  "Action": [
                    "lambda:InvokeFunction"
                  ],
                  "Resource": [
                    {
                      "Fn::GetAtt": [
                        "CreateUnderscores3UnderscorecontactLambdaFunction",
                        "Arn"
                      ]
                    },
                    {
                      "Fn::Sub": [
                        "${functionArn}:*",
                        {
                          "functionArn": {
                            "Fn::GetAtt": [
                              "CreateUnderscores3UnderscorecontactLambdaFunction",
                              "Arn"
                            ]
                          }
                        }
                      ]
                    }
                  ]
                }
              ]
            }
          }
        ]
      }
    },
    "CreateUnderscoremdmUnderscorecontactUnderscoretoUnderscorehsUnderscorestateUnderscoremachine": {
      "Type": "AWS::StepFunctions::StateMachine",
      "Properties": {
        "DefinitionString": {
          "Fn::Sub": [
            "{\n  \"Comment\": \"Workflow to create a MDM contact to Hubspot\",\n  \"StartAt\": \"createHsContact\",\n  \"States\": {\n    \"createHsContact\": {\n      \"Type\": \"Task\",\n      \"Resource\": \"${4014d3ceadea7405010d7aecb9471eaa}\",\n      \"InputPath\": \"$\",\n      \"OutputPath\": \"$\",\n      \"ResultPath\": \"$.lambdaResultContact\",\n      \"Next\": \"Find contact to create\"\n    },\n    \"Find contact to create\": {\n      \"Type\": \"Choice\",\n      \"Choices\": [\n        {\n          \"Variable\": \"$.lambdaResultContact.requestBody.total\",\n          \"NumericGreaterThanEquals\": 1,\n          \"Next\": \"Update HS contact\"\n        },\n        {\n          \"Variable\": \"$.lambdaResultContact.requestBody.total\",\n          \"NumericEquals\": 0,\n          \"Next\": \"Create HS contact\"\n        }\n      ]\n    },\n    \"Update HS contact\": {\n      \"Type\": \"Task\",\n      \"Resource\": \"${996ae18dcf103e32d2b805253b7eda26}\",\n      \"Next\": \"End of job\"\n    },\n    \"Create HS contact\": {\n      \"Type\": \"Task\",\n      \"Resource\": \"${c56369a3d527ff8574d14dd2fa6b0285}\",\n      \"Next\": \"End of job\"\n    },\n    \"End of job\": {\n      \"Type\": \"Pass\",\n      \"End\": true\n    }\n  }\n}",
            {
              "4014d3ceadea7405010d7aecb9471eaa": {
                "Fn::GetAtt": [
                  "GetUnderscorehsUnderscorecontactLambdaFunction",
                  "Arn"
                ]
              },
              "996ae18dcf103e32d2b805253b7eda26": {
                "Fn::GetAtt": [
                  "UpdateUnderscorehsUnderscorecontactLambdaFunction",
                  "Arn"
                ]
              },
              "c56369a3d527ff8574d14dd2fa6b0285": {
                "Fn::GetAtt": [
                  "CreateUnderscorehsUnderscorecontactLambdaFunction",
                  "Arn"
                ]
              }
            }
          ]
        },
        "RoleArn": {
          "Fn::GetAtt": [
            "CreateUnderscoremdmUnderscorecontactUnderscoretoUnderscorehsUnderscorestateUnderscoremachineRole",
            "Arn"
          ]
        },
        "StateMachineName": "create_mdm_contact_to_hs_state_machine"
      },
      "DependsOn": [
        "CreateUnderscoremdmUnderscorecontactUnderscoretoUnderscorehsUnderscorestateUnderscoremachineRole"
      ]
    },
    "UpdateUnderscoremdmUnderscorecontactUnderscoreonUnderscorehsUnderscorestateUnderscoremachine": {
      "Type": "AWS::StepFunctions::StateMachine",
      "Properties": {
        "DefinitionString": {
          "Fn::Sub": [
            "{\n  \"Comment\": \"Workflow to update a MDM contact on Hubspot\",\n  \"StartAt\": \"updateHsContact\",\n  \"States\": {\n    \"updateHsContact\": {\n      \"Type\": \"Task\",\n      \"Resource\": \"${4014d3ceadea7405010d7aecb9471eaa}\",\n      \"InputPath\": \"$\",\n      \"OutputPath\": \"$\",\n      \"ResultPath\": \"$.lambdaResultContact\",\n      \"Next\": \"Find contact to update\"\n    },\n    \"Find contact to update\": {\n      \"Type\": \"Choice\",\n      \"Choices\": [\n        {\n          \"Variable\": \"$.lambdaResultContact.requestBody.total\",\n          \"NumericGreaterThanEquals\": 1,\n          \"Next\": \"Update HS contact\"\n        },\n        {\n          \"Variable\": \"$.lambdaResultContact.requestBody.total\",\n          \"NumericEquals\": 0,\n          \"Next\": \"End of job\"\n        }\n      ]\n    },\n    \"Update HS contact\": {\n      \"Type\": \"Task\",\n      \"Resource\": \"${996ae18dcf103e32d2b805253b7eda26}\",\n      \"Next\": \"End of job\"\n    },\n    \"End of job\": {\n      \"Type\": \"Pass\",\n      \"End\": true\n    }\n  }\n}",
            {
              "4014d3ceadea7405010d7aecb9471eaa": {
                "Fn::GetAtt": [
                  "GetUnderscorehsUnderscorecontactLambdaFunction",
                  "Arn"
                ]
              },
              "996ae18dcf103e32d2b805253b7eda26": {
                "Fn::GetAtt": [
                  "UpdateUnderscorehsUnderscorecontactLambdaFunction",
                  "Arn"
                ]
              }
            }
          ]
        },
        "RoleArn": {
          "Fn::GetAtt": [
            "UpdateUnderscoremdmUnderscorecontactUnderscoreonUnderscorehsUnderscorestateUnderscoremachineRole",
            "Arn"
          ]
        },
        "StateMachineName": "update_mdm_contact_on_hs_state_machine"
      },
      "DependsOn": [
        "UpdateUnderscoremdmUnderscorecontactUnderscoreonUnderscorehsUnderscorestateUnderscoremachineRole"
      ]
    },
    "UpdateUnderscorehsUnderscorecontactUnderscoreonUnderscoremdmUnderscorestateUnderscoremachine": {
      "Type": "AWS::StepFunctions::StateMachine",
      "Properties": {
        "DefinitionString": {
          "Fn::Sub": [
            "{\n  \"Comment\": \"Workflow to update a HS contact on the MDM\",\n  \"StartAt\": \"updateHsContact\",\n  \"States\": {\n    \"updateHsContact\": {\n      \"Type\": \"Task\",\n      \"Resource\": \"${e57377b9ec78b73d30ecefee247273b7}\",\n      \"Next\": \"End of job\"\n    },\n    \"End of job\": {\n      \"Type\": \"Pass\",\n      \"End\": true\n    }\n  }\n}",
            {
              "e57377b9ec78b73d30ecefee247273b7": {
                "Fn::GetAtt": [
                  "CreateUnderscores3UnderscorecontactLambdaFunction",
                  "Arn"
                ]
              }
            }
          ]
        },
        "RoleArn": {
          "Fn::GetAtt": [
            "UpdateUnderscorehsUnderscorecontactUnderscoreonUnderscoremdmUnderscorestateUnderscoremachineRole",
            "Arn"
          ]
        },
        "StateMachineName": "update_hs_contact_on_mdm_state_machine"
      },
      "DependsOn": [
        "UpdateUnderscorehsUnderscorecontactUnderscoreonUnderscoremdmUnderscorestateUnderscoremachineRole"
      ]
    },
    "HttpApi": {
      "Type": "AWS::ApiGatewayV2::Api",
      "Properties": {
        "Name": "v1-hubspot-synchronisator",
        "ProtocolType": "HTTP"
      }
    },
    "HttpApiStage": {
      "Type": "AWS::ApiGatewayV2::Stage",
      "Properties": {
        "ApiId": {
          "Ref": "HttpApi"
        },
        "StageName": "$default",
        "AutoDeploy": true,
        "DefaultRouteSettings": {
          "DetailedMetricsEnabled": false
        }
      }
    },
    "GetUnderscorehsUnderscorecontactLambdaPermissionHttpApi": {
      "Type": "AWS::Lambda::Permission",
      "Properties": {
        "FunctionName": {
          "Fn::GetAtt": [
            "GetUnderscorehsUnderscorecontactLambdaFunction",
            "Arn"
          ]
        },
        "Action": "lambda:InvokeFunction",
        "Principal": "apigateway.amazonaws.com",
        "SourceArn": {
          "Fn::Join": [
            "",
            [
              "arn:",
              {
                "Ref": "AWS::Partition"
              },
              ":execute-api:",
              {
                "Ref": "AWS::Region"
              },
              ":",
              {
                "Ref": "AWS::AccountId"
              },
              ":",
              {
                "Ref": "HttpApi"
              },
              "/*"
            ]
          ]
        }
      }
    },
    "HttpApiIntegrationGetUnderscorehsUnderscorecontact": {
      "Type": "AWS::ApiGatewayV2::Integration",
      "Properties": {
        "ApiId": {
          "Ref": "HttpApi"
        },
        "IntegrationType": "AWS_PROXY",
        "IntegrationUri": {
          "Fn::GetAtt": [
            "GetUnderscorehsUnderscorecontactLambdaFunction",
            "Arn"
          ]
        },
        "PayloadFormatVersion": "2.0",
        "TimeoutInMillis": 15500
      }
    },
    "HttpApiRoutePostGethscontact": {
      "Type": "AWS::ApiGatewayV2::Route",
      "Properties": {
        "ApiId": {
          "Ref": "HttpApi"
        },
        "RouteKey": "POST /get_hs_contact",
        "Target": {
          "Fn::Join": [
            "/",
            [
              "integrations",
              {
                "Ref": "HttpApiIntegrationGetUnderscorehsUnderscorecontact"
              }
            ]
          ]
        }
      },
      "DependsOn": "HttpApiIntegrationGetUnderscorehsUnderscorecontact"
    },
    "UpdateUnderscorehsUnderscorecontactLambdaPermissionHttpApi": {
      "Type": "AWS::Lambda::Permission",
      "Properties": {
        "FunctionName": {
          "Fn::GetAtt": [
            "UpdateUnderscorehsUnderscorecontactLambdaFunction",
            "Arn"
          ]
        },
        "Action": "lambda:InvokeFunction",
        "Principal": "apigateway.amazonaws.com",
        "SourceArn": {
          "Fn::Join": [
            "",
            [
              "arn:",
              {
                "Ref": "AWS::Partition"
              },
              ":execute-api:",
              {
                "Ref": "AWS::Region"
              },
              ":",
              {
                "Ref": "AWS::AccountId"
              },
              ":",
              {
                "Ref": "HttpApi"
              },
              "/*"
            ]
          ]
        }
      }
    },
    "HttpApiIntegrationUpdateUnderscorehsUnderscorecontact": {
      "Type": "AWS::ApiGatewayV2::Integration",
      "Properties": {
        "ApiId": {
          "Ref": "HttpApi"
        },
        "IntegrationType": "AWS_PROXY",
        "IntegrationUri": {
          "Fn::GetAtt": [
            "UpdateUnderscorehsUnderscorecontactLambdaFunction",
            "Arn"
          ]
        },
        "PayloadFormatVersion": "2.0",
        "TimeoutInMillis": 15500
      }
    },
    "HttpApiRoutePatchUpdatehscontact": {
      "Type": "AWS::ApiGatewayV2::Route",
      "Properties": {
        "ApiId": {
          "Ref": "HttpApi"
        },
        "RouteKey": "PATCH /update_hs_contact",
        "Target": {
          "Fn::Join": [
            "/",
            [
              "integrations",
              {
                "Ref": "HttpApiIntegrationUpdateUnderscorehsUnderscorecontact"
              }
            ]
          ]
        }
      },
      "DependsOn": "HttpApiIntegrationUpdateUnderscorehsUnderscorecontact"
    },
    "CreateUnderscorehsUnderscorecontactLambdaPermissionHttpApi": {
      "Type": "AWS::Lambda::Permission",
      "Properties": {
        "FunctionName": {
          "Fn::GetAtt": [
            "CreateUnderscorehsUnderscorecontactLambdaFunction",
            "Arn"
          ]
        },
        "Action": "lambda:InvokeFunction",
        "Principal": "apigateway.amazonaws.com",
        "SourceArn": {
          "Fn::Join": [
            "",
            [
              "arn:",
              {
                "Ref": "AWS::Partition"
              },
              ":execute-api:",
              {
                "Ref": "AWS::Region"
              },
              ":",
              {
                "Ref": "AWS::AccountId"
              },
              ":",
              {
                "Ref": "HttpApi"
              },
              "/*"
            ]
          ]
        }
      }
    },
    "HttpApiIntegrationCreateUnderscorehsUnderscorecontact": {
      "Type": "AWS::ApiGatewayV2::Integration",
      "Properties": {
        "ApiId": {
          "Ref": "HttpApi"
        },
        "IntegrationType": "AWS_PROXY",
        "IntegrationUri": {
          "Fn::GetAtt": [
            "CreateUnderscorehsUnderscorecontactLambdaFunction",
            "Arn"
          ]
        },
        "PayloadFormatVersion": "2.0",
        "TimeoutInMillis": 15500
      }
    },
    "HttpApiRoutePostCreatehscontact": {
      "Type": "AWS::ApiGatewayV2::Route",
      "Properties": {
        "ApiId": {
          "Ref": "HttpApi"
        },
        "RouteKey": "POST /create_hs_contact",
        "Target": {
          "Fn::Join": [
            "/",
            [
              "integrations",
              {
                "Ref": "HttpApiIntegrationCreateUnderscorehsUnderscorecontact"
              }
            ]
          ]
        }
      },
      "DependsOn": "HttpApiIntegrationCreateUnderscorehsUnderscorecontact"
    },
    "CreateUnderscores3UnderscorecontactLambdaPermissionHttpApi": {
      "Type": "AWS::Lambda::Permission",
      "Properties": {
        "FunctionName": {
          "Fn::GetAtt": [
            "CreateUnderscores3UnderscorecontactLambdaFunction",
            "Arn"
          ]
        },
        "Action": "lambda:InvokeFunction",
        "Principal": "apigateway.amazonaws.com",
        "SourceArn": {
          "Fn::Join": [
            "",
            [
              "arn:",
              {
                "Ref": "AWS::Partition"
              },
              ":execute-api:",
              {
                "Ref": "AWS::Region"
              },
              ":",
              {
                "Ref": "AWS::AccountId"
              },
              ":",
              {
                "Ref": "HttpApi"
              },
              "/*"
            ]
          ]
        }
      }
    },
    "HttpApiIntegrationCreateUnderscores3Underscorecontact": {
      "Type": "AWS::ApiGatewayV2::Integration",
      "Properties": {
        "ApiId": {
          "Ref": "HttpApi"
        },
        "IntegrationType": "AWS_PROXY",
        "IntegrationUri": {
          "Fn::GetAtt": [
            "CreateUnderscores3UnderscorecontactLambdaFunction",
            "Arn"
          ]
        },
        "PayloadFormatVersion": "2.0",
        "TimeoutInMillis": 15500
      }
    },
    "HttpApiRoutePostCreates3contact": {
      "Type": "AWS::ApiGatewayV2::Route",
      "Properties": {
        "ApiId": {
          "Ref": "HttpApi"
        },
        "RouteKey": "POST /create_s3_contact",
        "Target": {
          "Fn::Join": [
            "/",
            [
              "integrations",
              {
                "Ref": "HttpApiIntegrationCreateUnderscores3Underscorecontact"
              }
            ]
          ]
        }
      },
      "DependsOn": "HttpApiIntegrationCreateUnderscores3Underscorecontact"
    },
    "ApiGatewayRestApi": {
      "Type": "AWS::ApiGateway::RestApi",
      "Properties": {
        "Name": "v1-hubspot-synchronisator",
        "EndpointConfiguration": {
          "Types": [
            "EDGE"
          ]
        }
      }
    },
    "ApiGatewayResourceCreatecontact": {
      "Type": "AWS::ApiGateway::Resource",
      "Properties": {
        "ParentId": {
          "Fn::GetAtt": [
            "ApiGatewayRestApi",
            "RootResourceId"
          ]
        },
        "PathPart": "createContact",
        "RestApiId": {
          "Ref": "ApiGatewayRestApi"
        }
      }
    },
    "ApiGatewayResourceUpdatecontact": {
      "Type": "AWS::ApiGateway::Resource",
      "Properties": {
        "ParentId": {
          "Fn::GetAtt": [
            "ApiGatewayRestApi",
            "RootResourceId"
          ]
        },
        "PathPart": "updateContact",
        "RestApiId": {
          "Ref": "ApiGatewayRestApi"
        }
      }
    },
    "ApiGatewayResourceUpdatemdmcontact": {
      "Type": "AWS::ApiGateway::Resource",
      "Properties": {
        "ParentId": {
          "Fn::GetAtt": [
            "ApiGatewayRestApi",
            "RootResourceId"
          ]
        },
        "PathPart": "updateMdmContact",
        "RestApiId": {
          "Ref": "ApiGatewayRestApi"
        }
      }
    },
    "ApiGatewayMethodCreatecontactPost": {
      "Type": "AWS::ApiGateway::Method",
      "Properties": {
        "HttpMethod": "POST",
        "RequestParameters": {},
        "AuthorizationType": "NONE",
        "ApiKeyRequired": false,
        "ResourceId": {
          "Ref": "ApiGatewayResourceCreatecontact"
        },
        "RestApiId": {
          "Ref": "ApiGatewayRestApi"
        },
        "Integration": {
          "IntegrationHttpMethod": "POST",
          "Type": "AWS",
          "Credentials": {
            "Fn::GetAtt": [
              "ApigatewayToStepFunctionsRole",
              "Arn"
            ]
          },
          "Uri": {
            "Fn::Join": [
              "",
              [
                "arn:",
                {
                  "Ref": "AWS::Partition"
                },
                ":apigateway:",
                {
                  "Ref": "AWS::Region"
                },
                ":states:action/StartExecution"
              ]
            ]
          },
          "PassthroughBehavior": "NEVER",
          "RequestTemplates": {
            "application/json": {
              "Fn::Sub": [
                "\n#set( $body = $util.escapeJavaScript($input.json('$')).replaceAll(\"\\\\'\", \"'\") )\n{\"input\": \"$body\", \"name\": \"$context.requestId\", \"stateMachineArn\":\"${StateMachineArn}\"}",
                {
                  "StateMachineArn": {
                    "Ref": "CreateUnderscoremdmUnderscorecontactUnderscoretoUnderscorehsUnderscorestateUnderscoremachine"
                  }
                }
              ]
            },
            "application/x-www-form-urlencoded": {
              "Fn::Sub": [
                "\n#set( $body = $util.escapeJavaScript($input.json('$')).replaceAll(\"\\\\'\", \"'\") )\n{\"input\": \"$body\", \"name\": \"$context.requestId\", \"stateMachineArn\":\"${StateMachineArn}\"}",
                {
                  "StateMachineArn": {
                    "Ref": "CreateUnderscoremdmUnderscorecontactUnderscoretoUnderscorehsUnderscorestateUnderscoremachine"
                  }
                }
              ]
            }
          },
          "IntegrationResponses": [
            {
              "StatusCode": 200,
              "SelectionPattern": 200,
              "ResponseParameters": {},
              "ResponseTemplates": {}
            },
            {
              "StatusCode": 400,
              "SelectionPattern": 400,
              "ResponseParameters": {},
              "ResponseTemplates": {}
            }
          ]
        },
        "MethodResponses": [
          {
            "ResponseParameters": {},
            "ResponseModels": {},
            "StatusCode": 200
          },
          {
            "ResponseParameters": {},
            "ResponseModels": {},
            "StatusCode": 400
          }
        ]
      }
    },
    "ApiGatewayMethodUpdatecontactPost": {
      "Type": "AWS::ApiGateway::Method",
      "Properties": {
        "HttpMethod": "POST",
        "RequestParameters": {},
        "AuthorizationType": "NONE",
        "ApiKeyRequired": false,
        "ResourceId": {
          "Ref": "ApiGatewayResourceUpdatecontact"
        },
        "RestApiId": {
          "Ref": "ApiGatewayRestApi"
        },
        "Integration": {
          "IntegrationHttpMethod": "POST",
          "Type": "AWS",
          "Credentials": {
            "Fn::GetAtt": [
              "ApigatewayToStepFunctionsRole",
              "Arn"
            ]
          },
          "Uri": {
            "Fn::Join": [
              "",
              [
                "arn:",
                {
                  "Ref": "AWS::Partition"
                },
                ":apigateway:",
                {
                  "Ref": "AWS::Region"
                },
                ":states:action/StartExecution"
              ]
            ]
          },
          "PassthroughBehavior": "NEVER",
          "RequestTemplates": {
            "application/json": {
              "Fn::Sub": [
                "\n#set( $body = $util.escapeJavaScript($input.json('$')).replaceAll(\"\\\\'\", \"'\") )\n{\"input\": \"$body\", \"name\": \"$context.requestId\", \"stateMachineArn\":\"${StateMachineArn}\"}",
                {
                  "StateMachineArn": {
                    "Ref": "UpdateUnderscoremdmUnderscorecontactUnderscoreonUnderscorehsUnderscorestateUnderscoremachine"
                  }
                }
              ]
            },
            "application/x-www-form-urlencoded": {
              "Fn::Sub": [
                "\n#set( $body = $util.escapeJavaScript($input.json('$')).replaceAll(\"\\\\'\", \"'\") )\n{\"input\": \"$body\", \"name\": \"$context.requestId\", \"stateMachineArn\":\"${StateMachineArn}\"}",
                {
                  "StateMachineArn": {
                    "Ref": "UpdateUnderscoremdmUnderscorecontactUnderscoreonUnderscorehsUnderscorestateUnderscoremachine"
                  }
                }
              ]
            }
          },
          "IntegrationResponses": [
            {
              "StatusCode": 200,
              "SelectionPattern": 200,
              "ResponseParameters": {},
              "ResponseTemplates": {}
            },
            {
              "StatusCode": 400,
              "SelectionPattern": 400,
              "ResponseParameters": {},
              "ResponseTemplates": {}
            }
          ]
        },
        "MethodResponses": [
          {
            "ResponseParameters": {},
            "ResponseModels": {},
            "StatusCode": 200
          },
          {
            "ResponseParameters": {},
            "ResponseModels": {},
            "StatusCode": 400
          }
        ]
      }
    },
    "ApiGatewayMethodUpdatemdmcontactPost": {
      "Type": "AWS::ApiGateway::Method",
      "Properties": {
        "HttpMethod": "POST",
        "RequestParameters": {},
        "AuthorizationType": "NONE",
        "ApiKeyRequired": false,
        "ResourceId": {
          "Ref": "ApiGatewayResourceUpdatemdmcontact"
        },
        "RestApiId": {
          "Ref": "ApiGatewayRestApi"
        },
        "Integration": {
          "IntegrationHttpMethod": "POST",
          "Type": "AWS",
          "Credentials": {
            "Fn::GetAtt": [
              "ApigatewayToStepFunctionsRole",
              "Arn"
            ]
          },
          "Uri": {
            "Fn::Join": [
              "",
              [
                "arn:",
                {
                  "Ref": "AWS::Partition"
                },
                ":apigateway:",
                {
                  "Ref": "AWS::Region"
                },
                ":states:action/StartExecution"
              ]
            ]
          },
          "PassthroughBehavior": "NEVER",
          "RequestTemplates": {
            "application/json": {
              "Fn::Sub": [
                "\n#set( $body = $util.escapeJavaScript($input.json('$')).replaceAll(\"\\\\'\", \"'\") )\n{\"input\": \"$body\", \"name\": \"$context.requestId\", \"stateMachineArn\":\"${StateMachineArn}\"}",
                {
                  "StateMachineArn": {
                    "Ref": "UpdateUnderscorehsUnderscorecontactUnderscoreonUnderscoremdmUnderscorestateUnderscoremachine"
                  }
                }
              ]
            },
            "application/x-www-form-urlencoded": {
              "Fn::Sub": [
                "\n#set( $body = $util.escapeJavaScript($input.json('$')).replaceAll(\"\\\\'\", \"'\") )\n{\"input\": \"$body\", \"name\": \"$context.requestId\", \"stateMachineArn\":\"${StateMachineArn}\"}",
                {
                  "StateMachineArn": {
                    "Ref": "UpdateUnderscorehsUnderscorecontactUnderscoreonUnderscoremdmUnderscorestateUnderscoremachine"
                  }
                }
              ]
            }
          },
          "IntegrationResponses": [
            {
              "StatusCode": 200,
              "SelectionPattern": 200,
              "ResponseParameters": {},
              "ResponseTemplates": {}
            },
            {
              "StatusCode": 400,
              "SelectionPattern": 400,
              "ResponseParameters": {},
              "ResponseTemplates": {}
            }
          ]
        },
        "MethodResponses": [
          {
            "ResponseParameters": {},
            "ResponseModels": {},
            "StatusCode": 200
          },
          {
            "ResponseParameters": {},
            "ResponseModels": {},
            "StatusCode": 400
          }
        ]
      }
    },
    "ApigatewayToStepFunctionsRole": {
      "Type": "AWS::IAM::Role",
      "Properties": {
        "AssumeRolePolicyDocument": {
          "Version": "2012-10-17",
          "Statement": [
            {
              "Effect": "Allow",
              "Principal": {
                "Service": "apigateway.amazonaws.com"
              },
              "Action": "sts:AssumeRole"
            }
          ]
        },
        "Policies": [
          {
            "PolicyName": "apigatewaytostepfunctions",
            "PolicyDocument": {
              "Version": "2012-10-17",
              "Statement": [
                {
                  "Effect": "Allow",
                  "Action": [
                    "states:StartExecution"
                  ],
                  "Resource": "*"
                }
              ]
            }
          }
        ]
      }
    },
    "ApiGatewayDeployment1639126657814": {
      "Type": "AWS::ApiGateway::Deployment",
      "Properties": {
        "RestApiId": {
          "Ref": "ApiGatewayRestApi"
        },
        "StageName": "v1"
      },
      "DependsOn": [
        "ApiGatewayMethodCreatecontactPost",
        "ApiGatewayMethodUpdatecontactPost",
        "ApiGatewayMethodUpdatemdmcontactPost"
      ]
    },
    "BodyHsValidator": {
      "Type": "AWS::ApiGateway::RequestValidator",
      "Properties": {
        "Name": "body-hs-validator",
        "RestApiId": {
          "Ref": "ApiGatewayRestApi"
        },
        "ValidateRequestBody": true,
        "ValidateRequestParameters": false
      }
    }
  },
  "Outputs": {
    "ServerlessDeploymentBucketName": {
      "Value": {
        "Ref": "ServerlessDeploymentBucket"
      },
      "Export": {
        "Name": "sls-hubspot-synchronisator-v1-ServerlessDeploymentBucketName"
      }
    },
    "GetUnderscorehsUnderscorecontactLambdaFunctionQualifiedArn": {
      "Description": "Current Lambda function version",
      "Value": {
        "Ref": "GetUnderscorehsUnderscorecontactLambdaVersioni0O1yjvjQ4UY0b0HfvtXPuIgUkhGU6Kz9AJxk8g"
      },
      "Export": {
        "Name": "sls-hubspot-synchronisator-v1-GetUnderscorehsUnderscorecontactLambdaFunctionQualifiedArn"
      }
    },
    "UpdateUnderscorehsUnderscorecontactLambdaFunctionQualifiedArn": {
      "Description": "Current Lambda function version",
      "Value": {
        "Ref": "UpdateUnderscorehsUnderscorecontactLambdaVersiony4MLB5gj9nGw5UYesRi0mZ01AxPq4WuVdlPbvSV1M0"
      },
      "Export": {
        "Name": "sls-hubspot-synchronisator-v1-UpdateUnderscorehsUnderscorecontactLambdaFunctionQualifiedArn"
      }
    },
    "CreateUnderscorehsUnderscorecontactLambdaFunctionQualifiedArn": {
      "Description": "Current Lambda function version",
      "Value": {
        "Ref": "CreateUnderscorehsUnderscorecontactLambdaVersionVwkuShfTQNFAaseESOE4yBgJW97hB7jKaO34JCd7c"
      },
      "Export": {
        "Name": "sls-hubspot-synchronisator-v1-CreateUnderscorehsUnderscorecontactLambdaFunctionQualifiedArn"
      }
    },
    "CreateUnderscores3UnderscorecontactLambdaFunctionQualifiedArn": {
      "Description": "Current Lambda function version",
      "Value": {
        "Ref": "CreateUnderscores3UnderscorecontactLambdaVersionZHs8vNWZwwHNGmEhuyQAKkOerW6N1pXKin9kcl79soU"
      },
      "Export": {
        "Name": "sls-hubspot-synchronisator-v1-CreateUnderscores3UnderscorecontactLambdaFunctionQualifiedArn"
      }
    },
    "CreateUnderscoremdmUnderscorecontactUnderscoretoUnderscorehsUnderscorestateUnderscoremachineArn": {
      "Description": "Current StateMachine Arn",
      "Value": {
        "Ref": "CreateUnderscoremdmUnderscorecontactUnderscoretoUnderscorehsUnderscorestateUnderscoremachine"
      },
      "Export": {
        "Name": "sls-hubspot-synchronisator-v1-CreateUnderscoremdmUnderscorecontactUnderscoretoUnderscorehsUnderscorestateUnderscoremachineArn"
      }
    },
    "UpdateUnderscoremdmUnderscorecontactUnderscoreonUnderscorehsUnderscorestateUnderscoremachineArn": {
      "Description": "Current StateMachine Arn",
      "Value": {
        "Ref": "UpdateUnderscoremdmUnderscorecontactUnderscoreonUnderscorehsUnderscorestateUnderscoremachine"
      },
      "Export": {
        "Name": "sls-hubspot-synchronisator-v1-UpdateUnderscoremdmUnderscorecontactUnderscoreonUnderscorehsUnderscorestateUnderscoremachineArn"
      }
    },
    "UpdateUnderscorehsUnderscorecontactUnderscoreonUnderscoremdmUnderscorestateUnderscoremachineArn": {
      "Description": "Current StateMachine Arn",
      "Value": {
        "Ref": "UpdateUnderscorehsUnderscorecontactUnderscoreonUnderscoremdmUnderscorestateUnderscoremachine"
      },
      "Export": {
        "Name": "sls-hubspot-synchronisator-v1-UpdateUnderscorehsUnderscorecontactUnderscoreonUnderscoremdmUnderscorestateUnderscoremachineArn"
      }
    },
    "HttpApiId": {
      "Description": "Id of the HTTP API",
      "Value": {
        "Ref": "HttpApi"
      },
      "Export": {
        "Name": "sls-hubspot-synchronisator-v1-HttpApiId"
      }
    },
    "HttpApiUrl": {
      "Description": "URL of the HTTP API",
      "Value": {
        "Fn::Join": [
          "",
          [
            "https://",
            {
              "Ref": "HttpApi"
            },
            ".execute-api.",
            {
              "Ref": "AWS::Region"
            },
            ".",
            {
              "Ref": "AWS::URLSuffix"
            }
          ]
        ]
      },
      "Export": {
        "Name": "sls-hubspot-synchronisator-v1-HttpApiUrl"
      }
    },
    "ServiceEndpoint": {
      "Description": "URL of the service endpoint",
      "Value": {
        "Fn::Join": [
          "",
          [
            "https://",
            {
              "Ref": "ApiGatewayRestApi"
            },
            ".execute-api.",
            {
              "Ref": "AWS::Region"
            },
            ".",
            {
              "Ref": "AWS::URLSuffix"
            },
            "/v1"
          ]
        ]
      },
      "Export": {
        "Name": "sls-hubspot-synchronisator-v1-ServiceEndpoint"
      }
    }
  }
}