%!PS-Adobe-3.0 EPSF-3.0
%%Creator: MATLAB, The MathWorks, Inc. Version 7.14.0.739 (R2012a). Operating System: Linux 2.6.29.6-213.eurecom.fc11.i686.PAE #1 SMP Wed Aug 5 13:00:22 CEST 2009 i686.
%%Title: /homes/hours/PhD/matlab/kpc/Backdoorcriterioncopula2d/cdf_rtt.eps
%%CreationDate: 02/12/2014  18:49:52
%%DocumentNeededFonts: Helvetica
%%+ Helvetica-Bold
%%DocumentProcessColors: Cyan Magenta Yellow Black
%%LanguageLevel: 2
%%Pages: 1
%%BoundingBox:  -447    15  1060   776
%%EndComments

%%BeginProlog
% MathWorks dictionary
/MathWorks 160 dict begin
% definition operators
/bdef {bind def} bind def
/ldef {load def} bind def
/xdef {exch def} bdef
/xstore {exch store} bdef
% operator abbreviations
/c  /clip ldef
/cc /concat ldef
/cp /closepath ldef
/gr /grestore ldef
/gs /gsave ldef
/mt /moveto ldef
/np /newpath ldef
/cm /currentmatrix ldef
/sm /setmatrix ldef
/rm /rmoveto ldef
/rl /rlineto ldef
/s {show newpath} bdef
/sc {setcmykcolor} bdef
/sr /setrgbcolor ldef
/sg /setgray ldef
/w /setlinewidth ldef
/j /setlinejoin ldef
/cap /setlinecap ldef
/rc {rectclip} bdef
/rf {rectfill} bdef
% page state control
/pgsv () def
/bpage {/pgsv save def} bdef
/epage {pgsv restore} bdef
/bplot /gsave ldef
/eplot {stroke grestore} bdef
% orientation switch
/portraitMode 0 def /landscapeMode 1 def /rotateMode 2 def
% coordinate system mappings
/dpi2point 0 def
% font control
/FontSize 0 def
/FMS {/FontSize xstore findfont [FontSize 0 0 FontSize neg 0 0]
  makefont setfont} bdef
/reencode {exch dup where {pop load} {pop StandardEncoding} ifelse
  exch dup 3 1 roll findfont dup length dict begin
  { 1 index /FID ne {def}{pop pop} ifelse } forall
  /Encoding exch def currentdict end definefont pop} bdef
/isroman {findfont /CharStrings get /Agrave known} bdef
/FMSR {3 1 roll 1 index dup isroman {reencode} {pop pop} ifelse
  exch FMS} bdef
/csm {1 dpi2point div -1 dpi2point div scale neg translate
 dup landscapeMode eq {pop -90 rotate}
  {rotateMode eq {90 rotate} if} ifelse} bdef
% line types: solid, dotted, dashed, dotdash
/SO { [] 0 setdash } bdef
/DO { [.5 dpi2point mul 4 dpi2point mul] 0 setdash } bdef
/DA { [6 dpi2point mul] 0 setdash } bdef
/DD { [.5 dpi2point mul 4 dpi2point mul 6 dpi2point mul 4
  dpi2point mul] 0 setdash } bdef
% macros for lines and objects
/L {lineto stroke} bdef
/MP {3 1 roll moveto 1 sub {rlineto} repeat} bdef
/AP {{rlineto} repeat} bdef
/PDlw -1 def
/W {/PDlw currentlinewidth def setlinewidth} def
/PP {closepath eofill} bdef
/DP {closepath stroke} bdef
/MR {4 -2 roll moveto dup  0 exch rlineto exch 0 rlineto
  neg 0 exch rlineto closepath} bdef
/FR {MR stroke} bdef
/PR {MR fill} bdef
/L1i {{currentfile picstr readhexstring pop} image} bdef
/tMatrix matrix def
/MakeOval {newpath tMatrix currentmatrix pop translate scale
0 0 1 0 360 arc tMatrix setmatrix} bdef
/FO {MakeOval stroke} bdef
/PO {MakeOval fill} bdef
/PD {currentlinewidth 2 div 0 360 arc fill
   PDlw -1 eq not {PDlw w /PDlw -1 def} if} def
/FA {newpath tMatrix currentmatrix pop translate scale
  0 0 1 5 -2 roll arc tMatrix setmatrix stroke} bdef
/PA {newpath tMatrix currentmatrix pop	translate 0 0 moveto scale
  0 0 1 5 -2 roll arc closepath tMatrix setmatrix fill} bdef
/FAn {newpath tMatrix currentmatrix pop translate scale
  0 0 1 5 -2 roll arcn tMatrix setmatrix stroke} bdef
/PAn {newpath tMatrix currentmatrix pop translate 0 0 moveto scale
  0 0 1 5 -2 roll arcn closepath tMatrix setmatrix fill} bdef
/vradius 0 def /hradius 0 def /lry 0 def
/lrx 0 def /uly 0 def /ulx 0 def /rad 0 def
/MRR {/vradius xdef /hradius xdef /lry xdef /lrx xdef /uly xdef
  /ulx xdef newpath tMatrix currentmatrix pop ulx hradius add uly
  vradius add translate hradius vradius scale 0 0 1 180 270 arc 
  tMatrix setmatrix lrx hradius sub uly vradius add translate
  hradius vradius scale 0 0 1 270 360 arc tMatrix setmatrix
  lrx hradius sub lry vradius sub translate hradius vradius scale
  0 0 1 0 90 arc tMatrix setmatrix ulx hradius add lry vradius sub
  translate hradius vradius scale 0 0 1 90 180 arc tMatrix setmatrix
  closepath} bdef
/FRR {MRR stroke } bdef
/PRR {MRR fill } bdef
/MlrRR {/lry xdef /lrx xdef /uly xdef /ulx xdef /rad lry uly sub 2 div def
  newpath tMatrix currentmatrix pop ulx rad add uly rad add translate
  rad rad scale 0 0 1 90 270 arc tMatrix setmatrix lrx rad sub lry rad
  sub translate rad rad scale 0 0 1 270 90 arc tMatrix setmatrix
  closepath} bdef
/FlrRR {MlrRR stroke } bdef
/PlrRR {MlrRR fill } bdef
/MtbRR {/lry xdef /lrx xdef /uly xdef /ulx xdef /rad lrx ulx sub 2 div def
  newpath tMatrix currentmatrix pop ulx rad add uly rad add translate
  rad rad scale 0 0 1 180 360 arc tMatrix setmatrix lrx rad sub lry rad
  sub translate rad rad scale 0 0 1 0 180 arc tMatrix setmatrix
  closepath} bdef
/FtbRR {MtbRR stroke } bdef
/PtbRR {MtbRR fill } bdef
/stri 6 array def /dtri 6 array def
/smat 6 array def /dmat 6 array def
/tmat1 6 array def /tmat2 6 array def /dif 3 array def
/asub {/ind2 exch def /ind1 exch def dup dup
  ind1 get exch ind2 get sub exch } bdef
/tri_to_matrix {
  2 0 asub 3 1 asub 4 0 asub 5 1 asub
  dup 0 get exch 1 get 7 -1 roll astore } bdef
/compute_transform {
  dmat dtri tri_to_matrix tmat1 invertmatrix 
  smat stri tri_to_matrix tmat2 concatmatrix } bdef
/ds {stri astore pop} bdef
/dt {dtri astore pop} bdef
/db {2 copy /cols xdef /rows xdef mul dup 3 mul string
  currentfile 
  3 index 0 eq {/ASCIIHexDecode filter}
  {/ASCII85Decode filter 3 index 2 eq {/RunLengthDecode filter} if }
  ifelse exch readstring pop
  dup 0 3 index getinterval /rbmap xdef
  dup 2 index dup getinterval /gbmap xdef
  1 index dup 2 mul exch getinterval /bbmap xdef pop pop}bdef
/it {gs np dtri aload pop moveto lineto lineto cp c
  cols rows 8 compute_transform 
  rbmap gbmap bbmap true 3 colorimage gr}bdef
/il {newpath moveto lineto stroke}bdef
currentdict end def
%%EndProlog

%%BeginSetup
MathWorks begin

0 cap

end
%%EndSetup

%%Page: 1 1
%%BeginPageSetup
%%PageBoundingBox:  -447    15  1060   776
MathWorks begin
bpage
%%EndPageSetup

%%BeginObject: obj1
bplot

/dpi2point 12 def
portraitMode -5364 9312 csm

    0     0 18095  9121 rc
85 dict begin %Colortable dictionary
/c0 { 0.000000 0.000000 0.000000 sr} bdef
/c1 { 1.000000 1.000000 1.000000 sr} bdef
/c2 { 0.900000 0.000000 0.000000 sr} bdef
/c3 { 0.000000 0.820000 0.000000 sr} bdef
/c4 { 0.000000 0.000000 0.800000 sr} bdef
/c5 { 0.910000 0.820000 0.320000 sr} bdef
/c6 { 1.000000 0.260000 0.820000 sr} bdef
/c7 { 0.000000 0.820000 0.820000 sr} bdef
c0
1 j
1 sg
   0    0 18096 9122 rf
6 w
0 7434 14024 0 0 -7434 2352 8118 4 MP
PP
-14024 0 0 7434 14024 0 0 -7434 2352 8118 5 MP stroke
4 w
DO
0 sg
2352 8118 mt 2352  684 L
2352  684 mt 2352  684 L
4105 8118 mt 4105  684 L
4105  684 mt 4105  684 L
5858 8118 mt 5858  684 L
5858  684 mt 5858  684 L
7611 8118 mt 7611  684 L
7611  684 mt 7611  684 L
9364 8118 mt 9364  684 L
9364  684 mt 9364  684 L
11117 8118 mt 11117  684 L
11117  684 mt 11117  684 L
12870 8118 mt 12870  684 L
12870  684 mt 12870  684 L
14623 8118 mt 14623  684 L
14623  684 mt 14623  684 L
16376 8118 mt 16376  684 L
16376  684 mt 16376  684 L
2352 8118 mt 16376 8118 L
16376 8118 mt 16376 8118 L
2352 7374 mt 16376 7374 L
16376 7374 mt 16376 7374 L
2352 6631 mt 16376 6631 L
16376 6631 mt 16376 6631 L
2352 5887 mt 16376 5887 L
16376 5887 mt 16376 5887 L
2352 5144 mt 16376 5144 L
16376 5144 mt 16376 5144 L
2352 4401 mt 16376 4401 L
16376 4401 mt 16376 4401 L
2352 3657 mt 16376 3657 L
16376 3657 mt 16376 3657 L
2352 2914 mt 16376 2914 L
16376 2914 mt 16376 2914 L
2352 2170 mt 16376 2170 L
16376 2170 mt 16376 2170 L
2352 1427 mt 16376 1427 L
16376 1427 mt 16376 1427 L
2352  684 mt 16376  684 L
16376  684 mt 16376  684 L
SO
6 w
2352 8118 mt 16376 8118 L
2352  684 mt 16376  684 L
2352 8118 mt 2352  684 L
16376 8118 mt 16376  684 L
2352 8118 mt 16376 8118 L
2352 8118 mt 2352  684 L
2352 8118 mt 2352 7977 L
2352  684 mt 2352  824 L
%%IncludeResource: font Helvetica
/Helvetica /ISOLatin1Encoding 192 FMSR

2299 8330 mt 
(0) s
4105 8118 mt 4105 7977 L
4105  684 mt 4105  824 L
3945 8330 mt 
(100) s
5858 8118 mt 5858 7977 L
5858  684 mt 5858  824 L
5698 8330 mt 
(200) s
7611 8118 mt 7611 7977 L
7611  684 mt 7611  824 L
7451 8330 mt 
(300) s
9364 8118 mt 9364 7977 L
9364  684 mt 9364  824 L
9204 8330 mt 
(400) s
11117 8118 mt 11117 7977 L
11117  684 mt 11117  824 L
10957 8330 mt 
(500) s
12870 8118 mt 12870 7977 L
12870  684 mt 12870  824 L
12710 8330 mt 
(600) s
14623 8118 mt 14623 7977 L
14623  684 mt 14623  824 L
14463 8330 mt 
(700) s
16376 8118 mt 16376 7977 L
16376  684 mt 16376  824 L
16216 8330 mt 
(800) s
2352 8118 mt 2492 8118 L
16376 8118 mt 16235 8118 L
2211 8189 mt 
(0) s
2352 7374 mt 2492 7374 L
16376 7374 mt 16235 7374 L
2051 7445 mt 
(0.1) s
2352 6631 mt 2492 6631 L
16376 6631 mt 16235 6631 L
2051 6702 mt 
(0.2) s
2352 5887 mt 2492 5887 L
16376 5887 mt 16235 5887 L
2051 5958 mt 
(0.3) s
2352 5144 mt 2492 5144 L
16376 5144 mt 16235 5144 L
2051 5215 mt 
(0.4) s
2352 4401 mt 2492 4401 L
16376 4401 mt 16235 4401 L
2051 4472 mt 
(0.5) s
2352 3657 mt 2492 3657 L
16376 3657 mt 16235 3657 L
2051 3728 mt 
(0.6) s
2352 2914 mt 2492 2914 L
16376 2914 mt 16235 2914 L
2051 2985 mt 
(0.7) s
2352 2170 mt 2492 2170 L
16376 2170 mt 16235 2170 L
2051 2241 mt 
(0.8) s
2352 1427 mt 2492 1427 L
16376 1427 mt 16235 1427 L
2051 1498 mt 
(0.9) s
2352  684 mt 2492  684 L
16376  684 mt 16235  684 L
2211  755 mt 
(1) s
2352 8118 mt 16376 8118 L
2352  684 mt 16376  684 L
2352 8118 mt 2352  684 L
16376 8118 mt 16376  684 L
gs 2352 684 14025 7435 rc
24 w
/c8 { 0.000000 0.000000 1.000000 sr} bdef
c8
0 -7 41 0 0 -7 256 0 0 -8 6 0 0 -7 256 0 
0 -8 66 0 0 -7 114 0 0 -8 117 0 0 -7 105 0 
0 -7 83 0 0 -8 152 0 0 -7 4 0 0 -8 13 0 
0 -7 4 0 0 -8 41 0 0 -7 33 0 0 -7 37 0 
0 -8 31 0 0 -7 105 0 0 -8 3 0 0 -7 42 0 
0 -8 80 0 0 -7 13 0 0 -7 24 0 0 -8 19 0 
0 -7 3 0 0 -8 1 0 0 -7 9 0 0 -8 14 0 
0 -7 10 0 0 -8 51 0 0 -7 4 0 0 -7 12 0 
0 -8 2 0 0 -7 13 0 0 -8 18 0 0 -7 10 0 
0 -8 9 0 0 -7 7 0 0 -7 38 0 0 -8 7 0 
0 -7 1 0 0 -8 13 0 0 -7 3 0 0 -8 10 0 
0 -7 11 0 0 -15 17 0 0 -7 2 0 0 -8 77 0 
0 -7 38 0 0 -8 22 0 0 -15 7 0 0 -7 24 0 
0 -7 12 0 0 -8 37 0 0 -7 13 0 0 -8 40 0 
0 -7 5 0 0 -8 12 0 0 -7 81 0 0 -7 6 0 
0 -8 5 0 0 -7 4 0 0 -8 31 0 0 -7 53 0 
0 -8 27 0 0 -7 19 0 0 -15 43 0 0 -7 15 0 
0 -8 5 0 0 -7 83 0 0 -8 111 0 0 -7 20 0 
0 -7 26 0 0 -8 32 0 0 -7 6 0 0 -8 4 0 
0 -7 30 0 0 -8 6 0 0 -7 17 0 0 -8 7 0 
0 -7 2 0 0 -7 2 0 0 -8 1 0 0 -7 9 0 
0 -8 7 0 0 -15 14 0 0 -7 1 0 0 -7 2 0 
0 -8 3 0 0 -7 3 0 0 -8 1 0 0 -7 7 0 
0 -8 13 0 0 -7 1 0 0 -7 5 0 0 -8 2 0 
0 -7 1 0 0 -15 3 0 0 -8 2 0 0 -7 6 0 
0 -8 2 0 0 -7 2 0 0 -7 3 0 0 -15 6 0 
0 -15 8 0 0 -8 2 0 0 -7 14 0 0 -7 1 0 
0 -8 1 0 0 -7 1 0 0 -8 4 0 0 -7 3 0 
0 -8 3 0 0 -14 10 0 0 -8 2 0 0 -7 1 0 
0 -8 1 0 0 -7 5 0 0 -15 6 0 0 -15 4 0 
0 -7 3 0 0 -8 1 0 0 -7 2 0 0 -8 4 0 
0 -7 1 0 0 -8 1 0 0 -7 2 0 0 -15 2 0 
0 -7 5 0 0 -8 2 0 0 -7 1 0 0 -8 3 0 
0 -7 1 0 0 -7 6 0 0 -8 2 0 0 -7 5 0 
0 -8 7 0 0 -7 2 0 0 -8 8 0 0 -14 3 0 
0 -15 12 0 0 -15 8 0 0 -8 3 0 0 -7 1 0 
0 -15 1 0 0 -7 3 0 0 -8 2 0 0 -7 1 0 
0 -8 1 0 0 -15 11748 1918 300 MP stroke
4 0 0 -7 3 0 0 -15 8 0 0 -7 7 0 0 -8 
1 0 0 -7 4 0 0 -8 8 0 0 -7 7 0 0 -7 
1 0 0 -8 1 0 0 -7 2 0 0 -8 1 0 0 -7 
3 0 0 -8 9 0 0 -7 2 0 0 -7 2 0 0 -8 
5 0 0 -7 1 0 0 -8 2 0 0 -7 2 0 0 -8 
1 0 0 -7 7 0 0 -8 1 0 0 -7 4 0 0 -7 
2 0 0 -8 13 0 0 -7 10 0 0 -8 7 0 0 -7 
2 0 0 -8 1 0 0 -7 10 0 0 -22 5 0 0 -8 
1 0 0 -7 6 0 0 -8 2 0 0 -7 1 0 0 -7 
1 0 0 -8 3 0 0 -7 2 0 0 -8 5 0 0 -15 
3 0 0 -7 1 0 0 -8 4 0 0 -7 2 0 0 -15 
1 0 0 -7 2 0 0 -15 2 0 0 -8 4 0 0 -14 
1 0 0 -8 1 0 0 -7 6 0 0 -8 2 0 0 -7 
2 0 0 -15 4 0 0 -15 1 0 0 -7 3 0 0 -15 
5 0 0 -15 2 0 0 -7 2 0 0 -8 1 0 0 -7 
2 0 0 -8 2 0 0 -7 3 0 0 -8 5 0 0 -7 
15 0 0 -15 2 0 0 -7 2 0 0 -8 6 0 0 -7 
12 0 0 -8 2 0 0 -15 3 0 0 -7 11 0 0 -7 
9 0 0 -15 1 0 0 -8 13 0 0 -7 2 0 0 -8 
11 0 0 -7 13 0 0 -7 2 0 0 -15 7 0 0 -8 
11 0 0 -7 1 0 0 -8 56 0 0 -7 3 0 0 -8 
7 0 0 -7 3 0 0 -7 4 0 0 -8 10 0 0 -7 
5 0 0 -8 8 0 0 -15 22 0 0 -7 73 0 0 -7 
3 0 0 -8 5 0 0 -7 3 0 0 -8 16 0 0 -7 
14 0 0 -15 37 0 0 -7 1 0 0 -8 2 0 0 -7 
1 0 0 -8 2 0 0 -7 2 0 0 -8 16 0 0 -7 
11 0 0 -7 33 0 0 -8 28 0 0 -7 26 0 0 -8 
57 0 0 -7 38 0 0 -8 20 0 0 -7 4 0 0 -8 
30 0 0 -7 17 0 0 -7 32 0 0 -8 25 0 0 -7 
3 0 0 -8 21 0 0 -7 8 0 0 -8 17 0 0 -7 
3 0 0 -7 8 0 0 -15 10 0 0 -8 13 0 0 -7 
38 0 0 -8 23 0 0 -7 9 0 0 -7 4 0 0 -8 
16 0 0 -7 5 0 0 -8 9 0 0 -7 29 0 0 -8 
13 0 0 -7 9 0 0 -8 53 0 0 -7 14 0 0 -7 
67 0 0 -8 10 0 0 -7 44 0 0 -8 10 0 0 -7 
3 0 0 -8 47 0 0 -7 77 0 0 -7 23 0 0 -8 
22 0 0 -7 110 0 0 -8 26 0 0 -7 5 0 0 -8 
43 0 0 -7 23 0 9978 3159 300 MP stroke
0 -7 8 0 0 -8 38 0 0 -7 8 0 0 -8 51 0 
0 -7 67 0 0 -8 17 0 0 -7 10 0 0 -7 21 0 
0 -8 34 0 0 -7 22 0 0 -8 50 0 0 -7 2 0 
0 -8 54 0 0 -7 6 0 0 -8 2 0 0 -7 29 0 
0 -7 8 0 0 -8 24 0 0 -7 37 0 0 -8 47 0 
0 -7 33 0 0 -8 38 0 0 -7 30 0 0 -7 5 0 
0 -8 102 0 0 -7 10 0 0 -8 43 0 0 -7 12 0 
0 -8 4 0 0 -7 3 0 0 -7 3 0 0 -8 9 0 
0 -7 83 0 0 -8 6 0 0 -7 6 0 0 -8 11 0 
0 -7 75 0 0 -8 17 0 0 -7 20 0 0 -7 19 0 
0 -8 39 0 0 -7 44 0 0 -8 33 0 0 -7 73 0 
0 -8 11 0 0 -7 11 0 0 -7 70 0 0 -8 3 0 
0 -7 61 0 0 -8 22 0 0 -7 263 0 0 -8 44 0 
0 -7 11 0 0 -7 1 0 0 -8 4 0 0 -7 118 0 
0 -8 21 0 0 -7 4 0 0 -8 1 0 0 -7 14 0 
0 -7 24 0 0 -8 6 0 0 -7 44 0 0 -8 35 0 
0 -7 85 0 0 -8 115 0 0 -7 55 0 0 -8 7 0 
0 -7 168 0 0 -7 15 0 0 -8 1 0 0 -7 193 0 
0 -8 99 0 0 -7 70 0 0 -8 11 0 0 -7 148 0 
0 -7 52 0 0 -8 62 0 0 -7 133 0 0 -8 34 0 
0 -7 75 0 0 -8 81 0 0 -7 127 0 0 -7 69 0 
0 -8 8 0 0 -7 31 0 0 -8 89 0 0 -7 18 0 
0 -8 24 0 0 -7 9 0 0 -8 16 0 0 -7 31 0 
0 -7 8 0 0 -8 2 0 0 -7 8 0 0 -8 21 0 
0 -7 25 0 0 -8 9 0 0 -7 17 0 0 -7 5 0 
0 -8 2 0 0 -15 8 0 0 -7 1 0 0 -15 9 0 
0 -7 23 0 0 -8 21 0 0 -7 19 0 0 -8 23 0 
0 -7 4 0 0 -8 12 0 0 -7 9 0 0 -7 4 0 
0 -8 2 0 0 -7 3 0 0 -8 60 0 0 -7 2 0 
0 -8 12 0 0 -7 13 0 0 -8 22 0 0 -7 5 0 
0 -7 1 0 0 -8 4 0 0 -7 4 0 0 -8 26 0 
0 -7 21 0 0 -8 9 0 0 -7 6 0 0 -7 5 0 
0 -8 2 0 0 -7 15 0 0 -15 4 0 0 -8 8 0 
0 -14 20 0 0 -8 2 0 0 -7 16 0 0 -8 1 0 
0 -7 48 0 0 -8 5 0 0 -7 38 0 0 -8 2 0 
0 -7 12 0 0 -7 14 0 0 -8 75 0 0 -7 9 0 
0 -8 8 0 0 -7 5 0 0 -15 4 0 0 -7 23 0 
0 -8 1 0 0 -7 5394 4311 300 MP stroke
1 0 0 -8 28 0 0 -7 1 0 0 -8 7 0 0 -7 
17 0 0 -7 9 0 0 -8 9 0 0 -7 16 0 0 -15 
18 0 0 -8 7 0 0 -7 8 0 0 -7 8 0 0 -8 
21 0 0 -7 24 0 0 -8 35 0 0 -7 12 0 0 -8 
76 0 0 -7 4 0 0 -8 11 0 0 -7 22 0 0 -7 
21 0 0 -8 9 0 0 -7 10 0 0 -8 54 0 0 -7 
10 0 0 -8 7 0 0 -7 40 0 0 -7 1 0 0 -8 
7 0 0 -7 21 0 0 -8 112 0 0 -7 2 0 0 -8 
9 0 0 -7 5 0 0 -7 14 0 0 -8 35 0 0 -7 
43 0 0 -15 43 0 0 -8 15 0 0 -7 34 0 0 -8 
19 0 0 -7 16 0 0 -7 10 0 0 -8 33 0 0 -7 
7 0 0 -8 17 0 0 -7 1 0 0 -8 3 0 0 -7 
3 0 0 -7 15 0 0 -8 3 0 0 -7 1 0 0 -15 
6 0 0 -8 5 0 0 -7 7 0 0 -7 8 0 0 -8 
6 0 0 -7 4 0 0 -8 1 0 0 -7 28 0 0 -8 
15 0 0 -7 1 0 0 -15 10 0 0 -7 2 0 0 -8 
5 0 0 -7 4 0 0 -8 4 0 0 -15 8 0 0 -14 
2 0 0 -8 5 0 0 -7 9 0 0 -15 2 0 0 -8 
2 0 0 -7 1 0 0 -7 3 0 0 -8 2 0 0 -7 
9 0 0 -8 3 0 0 -7 2 0 0 -15 2 0 0 -7 
5 0 0 -8 1 0 0 -7 7 0 0 -15 2 0 0 -8 
2 0 0 -15 12 0 0 -14 4 0 0 -8 3 0 0 -7 
2 0 0 -8 9 0 0 -7 1 0 0 -8 2 0 0 -7 
3 0 0 -7 2 0 0 -8 12 0 0 -7 2 0 0 -23 
6 0 0 -7 7 0 0 -15 3 0 0 -7 2 0 0 -8 
1 0 0 -7 1 0 0 -8 5 0 0 -15 3 0 0 -7 
2 0 0 -7 1 0 0 -8 4 0 0 -7 1 0 0 -15 
1 0 0 -8 5 0 0 -14 1 0 0 -8 2 0 0 -15 
1 0 0 -15 1 0 0 -7 3 0 0 -7 1 0 0 -8 
1 0 0 -15 1 0 0 -7 2 0 0 -8 1 0 0 -7 
3 0 0 -7 1 0 0 -15 1 0 0 -8 2 0 0 -15 
1 0 0 -7 1 0 0 -15 1 0 0 -7 1 0 0 -15 
1 0 0 -8 1 0 0 -7 3 0 0 -15 1 0 0 -7 
2 0 0 -8 2 0 0 -7 2 0 0 -23 1 0 0 -14 
1 0 0 -15 2 0 0 -8 1 0 0 -15 1 0 0 -22 
3 0 0 -7 1 0 0 -8 1 0 0 -22 3 0 0 -15 
1 0 0 -7 1 0 0 -15 3 0 0 -8 1 0 0 -15 
1 0 0 -7 2 0 4113 5694 300 MP stroke
0 -22 1 0 0 -15 1 0 0 -8 4 0 0 -22 1 0 
0 -15 1 0 0 -7 6 0 0 -23 1 0 0 -14 1 0 
0 -8 1 0 0 -15 2 0 0 -7 1 0 0 -8 1 0 
0 -7 1 0 0 -15 1 0 0 -7 1 0 0 -8 1 0 
0 -7 1 0 0 -8 2 0 0 -14 1 0 0 -15 2 0 
0 -8 1 0 0 -7 1 0 0 -15 1 0 0 -22 2 0 
0 -8 1 0 0 -15 1 0 0 -7 1 0 0 -8 1 0 
0 -7 3 0 0 -22 1 0 0 -8 1 0 0 -15 2 0 
0 -7 2 0 0 -22 1 0 0 -8 1 0 0 -15 1 0 
0 -7 1 0 0 -15 4 0 0 -7 1 0 0 -8 1 0 
0 -22 3 0 0 -8 3 0 0 -7 3 0 0 -15 1 0 
0 -15 2 0 0 -7 3 0 0 -8 1 0 0 -7 1 0 
0 -30 1 0 0 -7 1 0 0 -8 4 0 0 -7 1 0 
0 -15 1 0 0 -7 1 0 0 -15 1 0 0 -8 6 0 
0 -7 3 0 0 -15 2 0 0 -7 1 0 0 -15 1 0 
0 -8 3 0 0 -7 3 0 0 -8 2 0 0 -7 2 0 
0 -15 1 0 0 -7 1 0 0 -15 3 0 0 -8 1 0 
0 -7 1 0 0 -7 3 0 0 -8 1 0 0 -7 3 0 
0 -15 2 0 0 -15 2 0 0 -22 3 0 0 -8 3 0 
0 -7 1 0 0 -8 1 0 0 -7 4 0 0 -8 1 0 
0 -7 1 0 0 -7 1 0 0 -8 2 0 0 -15 3 0 
0 -7 1 0 0 -15 5 0 0 -7 1 0 0 -15 2 0 
0 -8 5 0 0 -7 2 0 0 -8 2 0 0 -7 1 0 
0 -7 2 0 0 -23 2 0 0 -15 1 0 0 -7 1 0 
0 -8 2 0 0 -7 3 0 0 -7 7 0 0 -8 5 0 
0 -7 3 0 0 -8 2 0 0 -7 7 0 0 -8 4 0 
0 -7 10 0 0 -15 1 0 0 -15 12 0 0 -7 1 0 
0 -15 1 0 0 -7 2 0 0 -8 1 0 0 -7 3 0 
0 -8 1 0 0 -7 2 0 0 -15 7 0 0 -7 6 0 
0 -8 45 0 0 -7 20 0 0 -8 8 0 0 -7 16 0 
0 -8 8 0 0 -7 6 0 0 -8 1 0 0 -7 42 0 
0 -7 28 0 0 -8 18 0 0 -7 65 0 0 -8 3 0 
0 -7 9 0 0 -8 10 0 0 -7 3 0 0 -7 1 0 
0 -8 8 0 0 -7 3 0 0 -15 7 0 0 -15 2 0 
0 -7 3 0 0 -15 5 0 0 -15 2 0 0 -8 1 0 
0 -7 2 0 0 -8 1 0 0 -7 3 0 0 -7 1 0 
0 -15 2 0 0 -23 2 0 0 -14 3 0 0 -8 2 0 
0 -30 3 0 0 -14 3528 7277 300 MP stroke
1 0 0 -8 4 0 0 -7 1 0 0 -15 2 0 0 -8 
7 0 0 -7 2 0 0 -7 1 0 0 -8 3 0 0 -7 
1 0 0 -15 3 0 0 -8 1 0 0 -7 1 0 0 -15 
1 0 0 -22 1 0 0 -15 1 0 0 -15 2 0 0 -7 
3 0 0 -8 3 0 0 -7 3 0 0 -23 1 0 0 -7 
1 0 0 -7 3 0 0 -8 1 0 0 -7 1 0 0 -8 
1 0 0 -7 2 0 0 -8 1 0 0 -22 3 0 0 -7 
3 0 0 -15 1 0 0 -15 1 0 0 -8 5 0 0 -14 
6 0 0 -8 1 0 0 -30 1 0 0 -7 1 0 0 -15 
1 0 0 -15 1 0 0 -7 1 0 0 -8 1 0 0 -14 
1 0 0 -23 1 0 0 -15 1 0 0 -7 4 0 0 -8 
1 0 0 -7 1 0 0 -7 1 0 0 -8 3 0 0 -7 
1 0 0 -8 2 0 0 -7 1 0 0 -15 1 0 0 -30 
3 0 0 -7 1 0 0 -8 4 0 0 -14 2 0 0 -8 
1 0 0 -7 1 0 0 -23 1 0 0 -22 1 0 0 -7 
1 0 0 -8 1 0 0 -7 2 0 0 -8 1 0 0 -7 
1 0 0 -15 1 0 0 -7 1 0 0 -15 1 0 0 -30 
4 0 0 -15 2 0 0 -7 2 0 0 -15 1 0 0 -8 
2 0 0 -7 2 0 0 -8 3396 8118 149 MP stroke
gr

24 w
c8
0 sg
8961 8526 mt 
(RTT \(ms\)) s
1953 4847 mt  -90 rotate
(CDF\(RTT\)) s
90 rotate
%%IncludeResource: font Helvetica-Bold
/Helvetica-Bold /ISOLatin1Encoding 192 FMSR

8666  532 mt 
(CDF of the RTT) s
6 w

end %%Color Dict

eplot
%%EndObject

epage
end

showpage

%%Trailer
%%EOF
