<svg xmlns="http://www.w3.org/2000/svg" width="20.698" height="38.795" viewBox="0 0 20.698 38.795">
  <g id="Group_5216" data-name="Group 5216" transform="translate(-254.937 -298.864)">
    <path id="Path_664" data-name="Path 664" d="M264.322,329.009a12.6,12.6,0,0,0-5.576-11.833,8.243,8.243,0,0,1-1.7-1.76,10.329,10.329,0,1,1,18.567-5.519,10.337,10.337,0,0,1-4.488,7.88,11.63,11.63,0,0,0-4.859,9.916c0,1.056.02,2.113-.006,3.169-.02.78.26,1.876-.965,1.889-1.252.014-.923-1.1-.964-1.864C264.3,330.263,264.322,329.635,264.322,329.009Zm.815-15.944a3.852,3.852,0,1,0-3.692-4.037A3.852,3.852,0,0,0,265.137,313.065Z"/>
    <path id="Path_665" data-name="Path 665" d="M295.327,451.717a1.651,1.651,0,0,1-1.5,1.635,1.686,1.686,0,0,1-1.751-1.528,1.731,1.731,0,0,1,1.584-1.715A1.678,1.678,0,0,1,295.327,451.717Z" transform="translate(-28.405 -115.695)"/>
    <path id="Path_666" data-name="Path 666" d="M286.3,334.215a3.852,3.852,0,1,1,4.015-3.726A3.834,3.834,0,0,1,286.3,334.215Z" transform="translate(-21.162 -21.15)" fill="#fff"/>
  </g>
</svg>
