  0
SECTION
  2
HEADER
  9
$ACADVER
  1
AC1009
  9
$DWGCODEPAGE
  3
ansi_1252
  9
$INSBASE
 10
0.0
 20
0.0
 30
0.0
  9
$EXTMIN
 10
-0.0000000000001137
 20
-1.800000000000011
 30
0.0
  9
$EXTMAX
 10
228.4
 20
183.1355940395871
 30
0.0
  9
$LIMMIN
 10
0.0
 20
0.0
  9
$LIMMAX
 10
12.0
 20
9.0
  9
$ORTHOMODE
 70
     0
  9
$REGENMODE
 70
     1
  9
$FILLMODE
 70
     1
  9
$QTEXTMODE
 70
     0
  9
$MIRRTEXT
 70
     1
  9
$DRAGMODE
 70
     2
  9
$LTSCALE
 40
1.0
  9
$OSMODE
 70
   511
  9
$ATTMODE
 70
     1
  9
$TEXTSIZE
 40
2.5
  9
$TRACEWID
 40
0.05
  9
$TEXTSTYLE
  7
STANDARD
  9
$CLAYER
  8
0
  9
$CELTYPE
  6
BYBLOCK
  9
$CECOLOR
 62
   256
  9
$DIMSCALE
 40
1.0
  9
$DIMASZ
 40
0.18
  9
$DIMEXO
 40
0.0625
  9
$DIMDLI
 40
0.36
  9
$DIMRND
 40
0.0
  9
$DIMDLE
 40
0.0
  9
$DIMEXE
 40
0.18
  9
$DIMTP
 40
0.0
  9
$DIMTM
 40
0.0
  9
$DIMTXT
 40
0.18
  9
$DIMCEN
 40
0.09
  9
$DIMTSZ
 40
0.0
  9
$DIMTOL
 70
     0
  9
$DIMLIM
 70
     0
  9
$DIMTIH
 70
     1
  9
$DIMTOH
 70
     1
  9
$DIMSE1
 70
     0
  9
$DIMSE2
 70
     0
  9
$DIMTAD
 70
     0
  9
$DIMZIN
 70
     0
  9
$DIMBLK
  1

  9
$DIMASO
 70
     1
  9
$DIMSHO
 70
     1
  9
$DIMPOST
  1

  9
$DIMAPOST
  1

  9
$DIMALT
 70
     0
  9
$DIMALTD
 70
     2
  9
$DIMALTF
 40
25.4
  9
$DIMLFAC
 40
1.0
  9
$DIMTOFL
 70
     0
  9
$DIMTVP
 40
0.0
  9
$DIMTIX
 70
     0
  9
$DIMSOXD
 70
     0
  9
$DIMSAH
 70
     0
  9
$DIMBLK1
  1

  9
$DIMBLK2
  1

  9
$DIMSTYLE
  2
STANDARD
  9
$DIMCLRD
 70
     0
  9
$DIMCLRE
 70
     0
  9
$DIMCLRT
 70
     0
  9
$DIMTFAC
 40
1.0
  9
$DIMGAP
 40
0.09
  9
$LUNITS
 70
     2
  9
$LUPREC
 70
     4
  9
$SKETCHINC
 40
0.1
  9
$FILLETRAD
 40
0.5
  9
$AUNITS
 70
     0
  9
$AUPREC
 70
     0
  9
$MENU
  1
.
  9
$ELEVATION
 40
0.0
  9
$PELEVATION
 40
0.0
  9
$THICKNESS
 40
0.0
  9
$LIMCHECK
 70
     0
  9
$CHAMFERA
 40
0.0
  9
$CHAMFERB
 40
0.0
  9
$SKPOLY
 70
     0
  9
$TDCREATE
 40
2447893.083333333
  9
$TDUPDATE
 40
2458679.559200556
  9
$TDINDWG
 40
0.0023832523
  9
$TDUSRTIMER
 40
0.0023832523
  9
$USRTIMER
 70
     1
  9
$ANGBASE
 50
0.0
  9
$ANGDIR
 70
     0
  9
$PDMODE
 70
     0
  9
$PDSIZE
 40
0.0
  9
$PLINEWID
 40
0.0
  9
$COORDS
 70
     1
  9
$SPLFRAME
 70
     0
  9
$SPLINETYPE
 70
     6
  9
$SPLINESEGS
 70
     8
  9
$ATTDIA
 70
     0
  9
$ATTREQ
 70
     1
  9
$HANDLING
 70
     1
  9
$HANDSEED
  5
100FF
  9
$SURFTAB1
 70
     6
  9
$SURFTAB2
 70
     6
  9
$SURFTYPE
 70
     6
  9
$SURFU
 70
     6
  9
$SURFV
 70
     6
  9
$UCSNAME
  2

  9
$UCSORG
 10
0.0
 20
0.0
 30
0.0
  9
$UCSXDIR
 10
1.0
 20
0.0
 30
0.0
  9
$UCSYDIR
 10
0.0
 20
1.0
 30
0.0
  9
$PUCSNAME
  2

  9
$PUCSORG
 10
0.0
 20
0.0
 30
0.0
  9
$PUCSXDIR
 10
1.0
 20
0.0
 30
0.0
  9
$PUCSYDIR
 10
0.0
 20
1.0
 30
0.0
  9
$USERI1
 70
     0
  9
$USERI2
 70
     0
  9
$USERI3
 70
     0
  9
$USERI4
 70
     0
  9
$USERI5
 70
     0
  9
$USERR1
 40
0.0
  9
$USERR2
 40
0.0
  9
$USERR3
 40
0.0
  9
$USERR4
 40
0.0
  9
$USERR5
 40
0.0
  9
$WORLDVIEW
 70
     1
  9
$SHADEDGE
 70
     3
  9
$SHADEDIF
 70
    70
  9
$TILEMODE
 70
     1
  9
$MAXACTVP
 70
    64
  9
$PLIMCHECK
 70
     0
  9
$PEXTMIN
 10
1.000000000000000E+20
 20
1.000000000000000E+20
 30
1.000000000000000E+20
  9
$PEXTMAX
 10
-1.000000000000000E+20
 20
-1.000000000000000E+20
 30
-1.000000000000000E+20
  9
$PLIMMIN
 10
0.0
 20
0.0
  9
$PLIMMAX
 10
0.0
 20
0.0
  9
$UNITMODE
 70
     0
  9
$VISRETAIN
 70
     1
  9
$PLINEGEN
 70
     0
  9
$PSLTSCALE
 70
     1
  0
ENDSEC
  0
SECTION
  2
TABLES
  0
TABLE
  2
VPORT
 70
     1
  0
VPORT
  2
*ACTIVE
 70
     0
 10
0.0
 20
0.0
 11
1.0
 21
1.0
 12
286.3055555555555
 22
148.5
 13
0.0
 23
0.0
 14
10.0
 24
10.0
 15
10.0
 25
10.0
 16
0.0
 26
0.0
 36
1.0
 17
0.0
 27
0.0
 37
0.0
 40
297.0
 41
1.92798353909465
 42
50.0
 43
0.0
 44
0.0
 50
0.0
 51
0.0
 71
     0
 72
   100
 73
     1
 74
     3
 75
     1
 76
     1
 77
     0
 78
     0
  0
ENDTAB
  0
TABLE
  2
LTYPE
 70
    39
  0
LTYPE
  2
CONTINUOUS
 70
     0
  3
Solid line
 72
    65
 73
     0
 40
0.0
  0
LTYPE
  2
PHANTOM2
 70
     0
  3
Phantom (.5x) ___ _ _ ___ _ _ ___ _ _ ___ _ _
 72
    65
 73
     6
 40
31.75
 49
15.875
 49
-3.175
 49
3.175
 49
-3.175
 49
3.175
 49
-3.175
  0
LTYPE
  2
DASHED2
 70
     0
  3
Dashed (.5x) _ _ _ _ _ _ _ _ _ _ _ _ _ _ _ _ _ 
 72
    65
 73
     2
 40
9.524999999999999
 49
6.35
 49
-3.175
  0
LTYPE
  2
HIDDEN
 70
     0
  3
Hidden __ __ __ __ __ __ __ __ __ __ __ __ __ __
 72
    65
 73
     2
 40
9.524999999999999
 49
6.35
 49
-3.175
  0
LTYPE
  2
ACAD_ISO07W100
 70
     0
  3
ISO dot . . . . . . . . . . . . . . . . . . . . 
 72
    65
 73
     2
 40
3.0
 49
0.1
 49
-2.9
  0
LTYPE
  2
ACAD_ISO10W100
 70
     0
  3
ISO dash dot __ . __ . __ . __ . __ . __ . __ . 
 72
    65
 73
     4
 40
18.0
 49
12.0
 49
-2.95
 49
0.1
 49
-2.95
  0
LTYPE
  2
CENTERX2
 70
     0
  3
Center (2x) ________  __  ________  __  _____
 72
    65
 73
     4
 40
101.6
 49
63.5
 49
-12.7
 49
12.7
 49
-12.7
  0
LTYPE
  2
HIDDEN2
 70
     0
  3
Hidden (.5x) _ _ _ _ _ _ _ _ _ _ _ _ _ _ _ _ _ 
 72
    65
 73
     2
 40
4.762499999999999
 49
3.175
 49
-1.5875
  0
LTYPE
  2
DOTX2
 70
     0
  3
Dot (2x) .  .  .  .  .  .  .  .  .  .  .  .  .  .
 72
    65
 73
     2
 40
12.7
 49
0.1
 49
-12.6
  0
LTYPE
  2
ACAD_ISO05W100
 70
     0
  3
ISO long-dash double-dot ____ .. ____ .. ____ . 
 72
    65
 73
     6
 40
33.00000000000001
 49
24.0
 49
-2.95
 49
0.1
 49
-2.9
 49
0.1
 49
-2.95
  0
LTYPE
  2
BORDERX2
 70
     0
  3
Border (2x) ____  ____  .  ____  ____  .  ___
 72
    65
 73
     6
 40
88.89999999999998
 49
25.4
 49
-12.7
 49
25.4
 49
-12.65
 49
0.1
 49
-12.65
  0
LTYPE
  2
DIVIDEX2
 70
     0
  3
Divide (2x) ________  .  .  ________  .  .  _
 72
    65
 73
     6
 40
63.5
 49
25.4
 49
-12.65
 49
0.1
 49
-12.6
 49
0.1
 49
-12.65
  0
LTYPE
  2
PHANTOMX2
 70
     0
  3
Phantom (2x) ____________    ____    ____   _
 72
    65
 73
     6
 40
127.0
 49
63.5
 49
-12.7
 49
12.7
 49
-12.7
 49
12.7
 49
-12.7
  0
LTYPE
  2
ACAD_ISO02W100
 70
     0
  3
ISO dash __ __ __ __ __ __ __ __ __ __ __ __ __
 72
    65
 73
     2
 40
15.0
 49
12.0
 49
-3.0
  0
LTYPE
  2
DIVIDE2
 70
     0
  3
Divide (.5x) __..__..__..__..__..__..__..__.._
 72
    65
 73
     6
 40
15.875
 49
6.35
 49
-3.125
 49
0.1
 49
-3.075
 49
0.1
 49
-3.125
  0
LTYPE
  2
ACAD_ISO15W100
 70
     0
  3
ISO double-dash triple-dot __ __ . . . __ __ . .
 72
    65
 73
    10
 40
39.00000000000001
 49
12.0
 49
-3.0
 49
12.0
 49
-2.95
 49
0.1
 49
-2.9
 49
0.1
 49
-2.9
 49
0.1
 49
-2.95
  0
LTYPE
  2
ACAD_ISO06W100
 70
     0
  3
ISO long-dash triple-dot ____ ... ____ ... ____
 72
    65
 73
     8
 40
36.00000000000001
 49
24.0
 49
-2.95
 49
0.1
 49
-2.9
 49
0.1
 49
-2.9
 49
0.1
 49
-2.95
  0
LTYPE
  2
BORDER
 70
     0
  3
Border __ __ . __ __ . __ __ . __ __ . __ __ .
 72
    65
 73
     6
 40
44.45
 49
12.7
 49
-6.35
 49
12.7
 49
-6.3
 49
0.1
 49
-6.3
  0
LTYPE
  2
DASHDOT
 70
     0
  3
Dash dot __ . __ . __ . __ . __ . __ . __ . __
 72
    65
 73
     4
 40
25.4
 49
12.7
 49
-6.3
 49
0.1
 49
-6.3
  0
LTYPE
  2
ACAD_ISO14W100
 70
     0
  3
ISO dash triple-dot __ . . . __ . . . __ . . . _
 72
    65
 73
     8
 40
24.0
 49
12.0
 49
-2.95
 49
0.1
 49
-2.9
 49
0.1
 49
-2.9
 49
0.1
 49
-2.95
  0
LTYPE
  2
ACAD_ISO09W100
 70
     0
  3
ISO long-dash double-short-dash ____ __ __ ____
 72
    65
 73
     6
 40
45.0
 49
24.0
 49
-3.0
 49
6.0
 49
-3.0
 49
6.0
 49
-3.0
  0
LTYPE
  2
ACAD_ISO03W100
 70
     0
  3
ISO dash space __    __    __    __    __    __
 72
    65
 73
     2
 40
30.0
 49
12.0
 49
-18.0
  0
LTYPE
  2
ACAD_ISO04W100
 70
     0
  3
ISO long-dash dot ____ . ____ . ____ . ____ . _
 72
    65
 73
     4
 40
30.0
 49
24.0
 49
-2.95
 49
0.1
 49
-2.95
  0
LTYPE
  2
DOT
 70
     0
  3
Dot . . . . . . . . . . . . . . . . . . . . . . . .
 72
    65
 73
     2
 40
6.35
 49
0.1
 49
-6.25
  0
LTYPE
  2
ACAD_ISO08W100
 70
     0
  3
ISO long-dash short-dash ____ __ ____ __ ____ _
 72
    65
 73
     4
 40
36.0
 49
24.0
 49
-3.0
 49
6.0
 49
-3.0
  0
LTYPE
  2
DASHDOTX2
 70
     0
  3
Dash dot (2x) ____  .  ____  .  ____  .  ___
 72
    65
 73
     4
 40
50.8
 49
25.4
 49
-12.65
 49
0.1
 49
-12.65
  0
LTYPE
  2
CENTER
 70
     0
  3
Center ____ _ ____ _ ____ _ ____ _ ____ _ ____
 72
    65
 73
     4
 40
50.8
 49
31.75
 49
-6.35
 49
6.35
 49
-6.35
  0
LTYPE
  2
DASHED
 70
     0
  3
Dashed __ __ __ __ __ __ __ __ __ __ __ __ __ _
 72
    65
 73
     2
 40
19.05
 49
12.7
 49
-6.35
  0
LTYPE
  2
DASHDOT2
 70
     0
  3
Dash dot (.5x) _._._._._._._._._._._._._._._.
 72
    65
 73
     4
 40
12.7
 49
6.35
 49
-3.125
 49
0.1
 49
-3.125
  0
LTYPE
  2
DOT2
 70
     0
  3
Dot (.5x) ........................................
 72
    65
 73
     2
 40
3.175
 49
0.1
 49
-3.075
  0
LTYPE
  2
DASHEDX2
 70
     0
  3
Dashed (2x) ____  ____  ____  ____  ____  ___
 72
    65
 73
     2
 40
38.09999999999999
 49
25.4
 49
-12.7
  0
LTYPE
  2
ACAD_ISO13W100
 70
     0
  3
ISO double-dash double-dot __ __ . . __ __ . . _
 72
    65
 73
     8
 40
36.00000000000001
 49
12.0
 49
-3.0
 49
12.0
 49
-2.95
 49
0.1
 49
-2.9
 49
0.1
 49
-2.95
  0
LTYPE
  2
ACAD_ISO11W100
 70
     0
  3
ISO double-dash dot __ __ . __ __ . __ __ . __ _
 72
    65
 73
     6
 40
33.0
 49
12.0
 49
-3.0
 49
12.0
 49
-2.95
 49
0.1
 49
-2.95
  0
LTYPE
  2
CENTER2
 70
     0
  3
Center (.5x) ___ _ ___ _ ___ _ ___ _ ___ _ ___
 72
    65
 73
     4
 40
28.575
 49
19.05
 49
-3.175
 49
3.175
 49
-3.175
  0
LTYPE
  2
BORDER2
 70
     0
  3
Border (.5x) __.__.__.__.__.__.__.__.__.__.__.
 72
    65
 73
     6
 40
22.225
 49
6.35
 49
-3.175
 49
6.35
 49
-3.125
 49
0.1
 49
-3.125
  0
LTYPE
  2
PHANTOM
 70
     0
  3
Phantom ______  __  __  ______  __  __  ______ 
 72
    65
 73
     6
 40
63.50000000000001
 49
31.75
 49
-6.35
 49
6.35
 49
-6.35
 49
6.35
 49
-6.35
  0
LTYPE
  2
DIVIDE
 70
     0
  3
Divide ____ . . ____ . . ____ . . ____ . . ____
 72
    65
 73
     6
 40
31.75
 49
12.7
 49
-6.3
 49
0.1
 49
-6.25
 49
0.1
 49
-6.3
  0
LTYPE
  2
ACAD_ISO12W100
 70
     0
  3
ISO dash double-dot __ . . __ . . __ . . __ . . 
 72
    65
 73
     6
 40
21.0
 49
12.0
 49
-2.95
 49
0.1
 49
-2.9
 49
0.1
 49
-2.95
  0
LTYPE
  2
HIDDENX2
 70
     0
  3
Hidden (2x) ____ ____ ____ ____ ____ ____ ____ 
 72
    65
 73
     2
 40
19.05
 49
12.7
 49
-6.35
  0
ENDTAB
  0
TABLE
  2
LAYER
 70
     3
  0
LAYER
  2
0
 70
     1
 62
     7
  6
CONTINUOUS
  0
LAYER
  2
INNEN
 70
     0
 62
     3
  6
CONTINUOUS
  0
LAYER
  2
AUSSEN
 70
     0
 62
     1
  6
CONTINUOUS
  0
ENDTAB
  0
TABLE
  2
STYLE
 70
     1
  0
STYLE
  2
STANDARD
 70
     0
 40
0.0
 41
1.0
 50
0.0
 71
     0
 42
2.5
  3

  4

  0
ENDTAB
  0
TABLE
  2
VIEW
 70
     0
  0
ENDTAB
  0
TABLE
  2
UCS
 70
     0
  0
ENDTAB
  0
TABLE
  2
APPID
 70
     2
  0
APPID
  2
ACAD
 70
     0
  0
APPID
  2
QCAD
 70
     0
  0
ENDTAB
  0
TABLE
  2
DIMSTYLE
 70
     1
  0
DIMSTYLE
  2
STANDARD
 70
     0
  3

  4

  5

  6

  7

 40
1.0
 41
0.18
 42
0.0625
 43
3.75
 44
0.18
 45
0.0
 46
0.0
 47
0.0
 48
0.0
140
0.18
141
2.5
142
0.0
143
0.03937007874016
144
1.0
145
0.0
146
1.0
147
0.09
 71
     0
 72
     0
 73
     0
 74
     0
 75
     0
 76
     0
 77
     1
 78
     8
170
     0
171
     3
172
     1
173
     0
174
     0
175
     0
176
     0
177
     0
178
     0
  0
ENDTAB
  0
ENDSEC
  0
SECTION
  2
BLOCKS
  0
BLOCK
  8
0
  2
$MODEL_SPACE
 70
     0
 10
0.0
 20
0.0
 30
0.0
  3
$MODEL_SPACE
  1

  0
ENDBLK
  5
21
  8
0
  0
BLOCK
 67
     1
  8
0
  2
$PAPER_SPACE
 70
     0
 10
0.0
 20
0.0
 30
0.0
  3
$PAPER_SPACE
  1

  0
ENDBLK
  5
1D
 67
     1
  8
0
  0
ENDSEC
  0
SECTION
  2
ENTITIES
  0
POLYLINE
  5
5B
  8
AUSSEN
 66
     1
 10
0.0
 20
0.0
 30
0.0
 70
     1
  0
VERTEX
  5
100C3
  8
AUSSEN
 10
44.8
 20
0.0000000000000014
 30
0.0
  0
VERTEX
  5
100C4
  8
AUSSEN
 10
44.79999999999993
 20
140.0
 30
0.0
  0
VERTEX
  5
100C5
  8
AUSSEN
 10
44.79999999999997
 20
155.0
 30
0.0
  0
VERTEX
  5
100C6
  8
AUSSEN
 10
88.39999999999999
 20
140.0
 30
0.0
  0
VERTEX
  5
100C7
  8
AUSSEN
 10
88.39999999999999
 20
-0.0000000000000066
 30
0.0
  0
SEQEND
  5
100F9
  8
AUSSEN
  0
POLYLINE
  5
5C
  8
AUSSEN
 66
     1
 10
0.0
 20
0.0
 30
0.0
 70
     1
  0
VERTEX
  5
100C8
  8
AUSSEN
 10
93.0
 20
0.0000000000000067
 30
0.0
  0
VERTEX
  5
100C9
  8
AUSSEN
 10
92.99999999999994
 20
140.0
 30
0.0
  0
VERTEX
  5
100CA
  8
AUSSEN
 10
92.99999999999997
 20
155.0
 30
0.0
  0
VERTEX
  5
100CB
  8
AUSSEN
 10
136.6
 20
140.0
 30
0.0
  0
VERTEX
  5
100CC
  8
AUSSEN
 10
136.6
 20
-0.0000000000000013
 30
0.0
  0
SEQEND
  5
100FA
  8
AUSSEN
  0
POLYLINE
  5
5D
  8
AUSSEN
 66
     1
 10
0.0
 20
0.0
 30
0.0
 70
     1
  0
VERTEX
  5
100CD
  8
AUSSEN
 10
139.7867848723481
 20
0.3108983653536926
 30
0.0
  0
VERTEX
  5
100CE
  8
AUSSEN
 10
139.786784872348
 20
140.3108983653537
 30
0.0
  0
VERTEX
  5
100CF
  8
AUSSEN
 10
139.786784872348
 20
140.3108983653537
 30
0.0
  0
VERTEX
  5
100D0
  8
AUSSEN
 10
183.386784872348
 20
140.3108983653537
 30
0.0
  0
VERTEX
  5
100D1
  8
AUSSEN
 10
183.3867848723481
 20
0.3108983653536926
 30
0.0
  0
SEQEND
  5
100FB
  8
AUSSEN
  0
LINE
  5
5E
  8
AUSSEN
 10
205.186208059797
 20
85.32534858523093
 30
0.0
 11
186.436208059797
 21
85.32534858523093
 31
0.0
  0
LINE
  5
5F
  8
AUSSEN
 10
205.35
 20
40.0
 30
0.0
 11
186.6
 21
40.0
 31
0.0
  0
CIRCLE
  5
60
  8
INNEN
 10
153.8849542555763
 20
147.8407649347719
 30
0.0
 40
3.45
  0
CIRCLE
  5
61
  8
INNEN
 10
206.0453645119865
 20
145.6144059604129
 30
0.0
 40
3.45
  0
POLYLINE
  5
62
  8
AUSSEN
 66
     1
 10
0.0
 20
0.0
 30
0.0
 70
     1
  0
VERTEX
  5
100D2
  8
AUSSEN
 10
0.0
 20
-0.0000000000000013
 30
0.0
  0
VERTEX
  5
100D3
  8
AUSSEN
 10
-0.0000000000000853
 20
140.0
 30
0.0
  0
VERTEX
  5
100D4
  8
AUSSEN
 10
-0.0000000000000284
 20
155.0
 30
0.0
  0
VERTEX
  5
100D5
  8
AUSSEN
 10
43.59999999999997
 20
155.0
 30
0.0
  0
VERTEX
  5
100D6
  8
AUSSEN
 10
43.59999999999999
 20
-0.0000000000000013
 30
0.0
  0
SEQEND
  5
100FC
  8
AUSSEN
  0
LINE
  5
63
  8
INNEN
 10
65.35
 20
30.0
 30
0.0
 11
67.85
 21
30.0
 31
0.0
  0
LINE
  5
64
  8
INNEN
 10
113.55
 20
30.0
 30
0.0
 11
116.05
 21
30.0
 31
0.0
  0
LINE
  5
65
  8
INNEN
 10
160.3367848723481
 20
30.31089836535369
 30
0.0
 11
162.8367848723481
 21
30.31089836535369
 31
0.0
  0
POLYLINE
  5
66
  8
INNEN
 66
     1
 10
0.0
 20
0.0
 30
0.0
  0
VERTEX
  5
100D7
  8
INNEN
 10
130.8395897435898
 20
182.226358974359
 30
0.0
  0
VERTEX
  5
100D8
  8
INNEN
 10
112.4265038060898
 20
180.351358974359
 30
0.0
  0
VERTEX
  5
100D9
  8
INNEN
 10
96.46849599358977
 20
178.476358974359
 30
0.0
  0
VERTEX
  5
100DA
  8
INNEN
 10
82.96556630608978
 20
176.601358974359
 30
0.0
  0
VERTEX
  5
100DB
  8
INNEN
 10
71.91771474358978
 20
174.726358974359
 30
0.0
  0
VERTEX
  5
100DC
  8
INNEN
 10
63.32494130608977
 20
172.851358974359
 30
0.0
  0
VERTEX
  5
100DD
  8
INNEN
 10
57.18724599358978
 20
170.976358974359
 30
0.0
  0
VERTEX
  5
100DE
  8
INNEN
 10
53.50462880608978
 20
169.101358974359
 30
0.0
  0
VERTEX
  5
100DF
  8
INNEN
 10
52.27708974358978
 20
167.226358974359
 30
0.0
  0
VERTEX
  5
100E0
  8
INNEN
 10
53.50462880608978
 20
165.351358974359
 30
0.0
  0
VERTEX
  5
100E1
  8
INNEN
 10
57.18724599358976
 20
163.476358974359
 30
0.0
  0
VERTEX
  5
100E2
  8
INNEN
 10
63.32494130608975
 20
161.601358974359
 30
0.0
  0
VERTEX
  5
100E3
  8
INNEN
 10
71.91771474358976
 20
159.726358974359
 30
0.0
  0
VERTEX
  5
100E4
  8
INNEN
 10
82.96556630608974
 20
157.851358974359
 30
0.0
  0
VERTEX
  5
100E5
  8
INNEN
 10
96.46849599358973
 20
155.976358974359
 30
0.0
  0
VERTEX
  5
100E6
  8
INNEN
 10
112.4265038060897
 20
154.101358974359
 30
0.0
  0
VERTEX
  5
100E7
  8
INNEN
 10
130.8395897435898
 20
152.226358974359
 30
0.0
  0
SEQEND
  5
100FD
  8
INNEN
  0
LINE
  5
67
  8
INNEN
 10
189.436208059797
 20
48.32534858523093
 30
0.0
 11
223.436208059797
 21
48.32534858523093
 31
0.0
  0
LINE
  5
68
  8
INNEN
 10
189.6
 20
2.999999999999999
 30
0.0
 11
223.6
 21
2.999999999999999
 31
0.0
  0
LINE
  5
69
  8
AUSSEN
 10
132.0849542555763
 20
149.0907649347719
 30
0.0
 11
132.0849542555763
 21
146.5907649347719
 31
0.0
  0
LINE
  5
6A
  8
AUSSEN
 10
184.2453645119865
 20
146.8644059604129
 30
0.0
 11
184.2453645119865
 21
144.3644059604129
 31
0.0
  0
POLYLINE
  5
6B
  8
INNEN
 66
     1
 10
0.0
 20
0.0
 30
0.0
  0
VERTEX
  5
100E8
  8
INNEN
 10
225.3546354880135
 20
183.1355940395871
 30
0.0
  0
VERTEX
  5
100E9
  8
INNEN
 10
206.9415495505135
 20
181.2605940395871
 30
0.0
  0
VERTEX
  5
100EA
  8
INNEN
 10
190.9835417380135
 20
179.3855940395871
 30
0.0
  0
VERTEX
  5
100EB
  8
INNEN
 10
177.4806120505135
 20
177.5105940395871
 30
0.0
  0
VERTEX
  5
100EC
  8
INNEN
 10
166.4327604880135
 20
175.6355940395871
 30
0.0
  0
VERTEX
  5
100ED
  8
INNEN
 10
157.8399870505135
 20
173.7605940395871
 30
0.0
  0
VERTEX
  5
100EE
  8
INNEN
 10
151.7022917380135
 20
171.8855940395871
 30
0.0
  0
VERTEX
  5
100EF
  8
INNEN
 10
148.0196745505135
 20
170.0105940395871
 30
0.0
  0
VERTEX
  5
100F0
  8
INNEN
 10
146.7921354880135
 20
168.1355940395871
 30
0.0
  0
VERTEX
  5
100F1
  8
INNEN
 10
148.0196745505135
 20
166.2605940395871
 30
0.0
  0
VERTEX
  5
100F2
  8
INNEN
 10
151.7022917380135
 20
164.3855940395871
 30
0.0
  0
VERTEX
  5
100F3
  8
INNEN
 10
157.8399870505135
 20
162.5105940395871
 30
0.0
  0
VERTEX
  5
100F4
  8
INNEN
 10
166.4327604880135
 20
160.6355940395871
 30
0.0
  0
VERTEX
  5
100F5
  8
INNEN
 10
177.4806120505135
 20
158.7605940395871
 30
0.0
  0
VERTEX
  5
100F6
  8
INNEN
 10
190.9835417380135
 20
156.8855940395871
 30
0.0
  0
VERTEX
  5
100F7
  8
INNEN
 10
206.9415495505134
 20
155.0105940395871
 30
0.0
  0
VERTEX
  5
100F8
  8
INNEN
 10
225.3546354880135
 20
153.1355940395871
 30
0.0
  0
SEQEND
  5
100FE
  8
INNEN
  0
LINE
  5
6C
  8
INNEN
 10
20.55
 20
30.0
 30
0.0
 11
23.05
 21
30.0
 31
0.0
  0
LINE
  5
6D
  8
INNEN
 10
65.35
 20
40.0
 30
0.0
 11
67.85
 21
40.0
 31
0.0
  0
LINE
  5
6E
  8
INNEN
 10
113.55
 20
40.00000000000001
 30
0.0
 11
116.05
 21
40.00000000000001
 31
0.0
  0
LINE
  5
6F
  8
INNEN
 10
160.3367848723481
 20
40.31089836535369
 30
0.0
 11
162.8367848723481
 21
40.31089836535369
 31
0.0
  0
LINE
  5
70
  8
INNEN
 10
223.436208059797
 20
48.32534858523093
 30
0.0
 11
223.436208059797
 21
82.32534858523093
 31
0.0
  0
LINE
  5
71
  8
INNEN
 10
223.6
 20
2.999999999999999
 30
0.0
 11
223.6
 21
37.0
 31
0.0
  0
LINE
  5
72
  8
AUSSEN
 10
175.6849542555763
 20
146.5907649347719
 30
0.0
 11
175.6849542555763
 21
149.0907649347719
 31
0.0
  0
LINE
  5
73
  8
AUSSEN
 10
227.8453645119865
 20
144.3644059604129
 30
0.0
 11
227.8453645119865
 21
146.8644059604129
 31
0.0
  0
LINE
  5
74
  8
INNEN
 10
20.55
 20
40.0
 30
0.0
 11
23.05
 21
40.0
 31
0.0
  0
LINE
  5
75
  8
INNEN
 10
65.34999999999998
 20
138.2
 30
0.0
 11
67.84999999999998
 21
138.2
 31
0.0
  0
LINE
  5
76
  8
INNEN
 10
113.55
 20
138.2
 30
0.0
 11
116.05
 21
138.2
 31
0.0
  0
LINE
  5
77
  8
INNEN
 10
160.3367848723481
 20
138.5108983653537
 30
0.0
 11
162.8367848723481
 21
138.5108983653537
 31
0.0
  0
LINE
  5
78
  8
INNEN
 10
223.436208059797
 20
82.32534858523093
 30
0.0
 11
189.436208059797
 21
82.32534858523093
 31
0.0
  0
LINE
  5
79
  8
INNEN
 10
223.6
 20
37.0
 30
0.0
 11
189.6
 21
37.0
 31
0.0
  0
LINE
  5
7A
  8
AUSSEN
 10
175.6849542555763
 20
149.0907649347719
 30
0.0
 11
158.7401705944906
 21
149.0907649347719
 31
0.0
  0
LINE
  5
7B
  8
AUSSEN
 10
227.8453645119865
 20
146.8644059604129
 30
0.0
 11
210.9005808509008
 21
146.8644059604129
 31
0.0
  0
LINE
  5
7C
  8
INNEN
 10
20.54999999999997
 20
138.2
 30
0.0
 11
23.04999999999997
 21
138.2
 31
0.0
  0
LINE
  5
7D
  8
INNEN
 10
65.35000000000001
 20
70.0
 30
0.0
 11
67.85000000000001
 21
70.0
 31
0.0
  0
LINE
  5
7E
  8
INNEN
 10
113.55
 20
70.0
 30
0.0
 11
116.05
 21
70.0
 31
0.0
  0
LINE
  5
7F
  8
INNEN
 10
160.3367848723481
 20
70.3108983653537
 30
0.0
 11
162.8367848723481
 21
70.3108983653537
 31
0.0
  0
LINE
  5
80
  8
INNEN
 10
189.436208059797
 20
82.32534858523093
 30
0.0
 11
189.436208059797
 21
48.32534858523093
 31
0.0
  0
LINE
  5
81
  8
INNEN
 10
189.6
 20
37.0
 30
0.0
 11
189.6
 21
2.999999999999999
 31
0.0
  0
LINE
  5
82
  8
AUSSEN
 10
149.029737916662
 20
149.0907649347719
 30
0.0
 11
132.0849542555763
 21
149.0907649347719
 31
0.0
  0
LINE
  5
83
  8
AUSSEN
 10
201.1901481730722
 20
146.8644059604129
 30
0.0
 11
184.2453645119865
 21
146.8644059604129
 31
0.0
  0
LINE
  5
84
  8
INNEN
 10
20.55
 20
70.0
 30
0.0
 11
23.05
 21
70.0
 31
0.0
  0
LINE
  5
85
  8
INNEN
 10
65.35
 20
4.999999999999999
 30
0.0
 11
67.85
 21
4.999999999999999
 31
0.0
  0
LINE
  5
86
  8
INNEN
 10
113.55
 20
5.000000000000004
 30
0.0
 11
116.05
 21
5.000000000000004
 31
0.0
  0
LINE
  5
87
  8
INNEN
 10
160.3367848723481
 20
5.310898365353693
 30
0.0
 11
162.8367848723481
 21
5.310898365353693
 31
0.0
  0
LINE
  5
88
  8
AUSSEN
 10
205.186208059797
 20
43.52534858523093
 30
0.0
 11
207.686208059797
 21
43.52534858523093
 31
0.0
  0
LINE
  5
89
  8
AUSSEN
 10
205.35
 20
-1.800000000000002
 30
0.0
 11
207.85
 21
-1.800000000000002
 31
0.0
  0
LINE
  5
8A
  8
AUSSEN
 10
132.0849542555763
 20
146.5907649347719
 30
0.0
 11
149.029737916662
 21
146.5907649347719
 31
0.0
  0
LINE
  5
8B
  8
AUSSEN
 10
184.2453645119865
 20
144.3644059604129
 30
0.0
 11
201.1901481730722
 21
144.3644059604129
 31
0.0
  0
LINE
  5
8C
  8
INNEN
 10
20.54999999999999
 20
4.999999999999999
 30
0.0
 11
23.04999999999999
 21
4.999999999999999
 31
0.0
  0
LINE
  5
8D
  8
INNEN
 10
67.85
 20
30.0
 30
0.0
 11
67.85
 21
31.8
 31
0.0
  0
LINE
  5
8E
  8
INNEN
 10
116.05
 20
30.0
 30
0.0
 11
116.05
 21
31.8
 31
0.0
  0
LINE
  5
8F
  8
INNEN
 10
162.8367848723481
 20
30.31089836535369
 30
0.0
 11
162.8367848723481
 21
32.11089836535369
 31
0.0
  0
LINE
  5
90
  8
AUSSEN
 10
228.236208059797
 20
64.07534858523093
 30
0.0
 11
228.236208059797
 21
66.57534858523093
 31
0.0
  0
LINE
  5
91
  8
AUSSEN
 10
228.4
 20
18.75
 30
0.0
 11
228.4
 21
21.25
 31
0.0
  0
LINE
  5
92
  8
AUSSEN
 10
158.7401705944906
 20
146.5907649347719
 30
0.0
 11
175.6849542555763
 21
146.5907649347719
 31
0.0
  0
LINE
  5
93
  8
AUSSEN
 10
210.9005808509008
 20
144.3644059604129
 30
0.0
 11
227.8453645119865
 21
144.3644059604129
 31
0.0
  0
LINE
  5
94
  8
INNEN
 10
23.05
 20
30.0
 30
0.0
 11
23.05
 21
31.8
 31
0.0
  0
LINE
  5
95
  8
INNEN
 10
67.85
 20
40.0
 30
0.0
 11
67.85
 21
41.8
 31
0.0
  0
LINE
  5
96
  8
INNEN
 10
116.05
 20
40.00000000000001
 30
0.0
 11
116.05
 21
41.8
 31
0.0
  0
LINE
  5
97
  8
INNEN
 10
162.8367848723481
 20
40.31089836535369
 30
0.0
 11
162.8367848723481
 21
42.11089836535369
 31
0.0
  0
LINE
  5
98
  8
AUSSEN
 10
207.686208059797
 20
43.52534858523093
 30
0.0
 11
207.686208059797
 21
45.32534858523093
 31
0.0
  0
LINE
  5
99
  8
AUSSEN
 10
207.85
 20
-1.800000000000002
 30
0.0
 11
207.85
 21
-0.0000000000000013
 31
0.0
  0
ARC
  5
9A
  8
AUSSEN
 10
153.8849542555763
 20
147.8407649347719
 30
0.0
 40
5.013544225162513
 50
194.4375501828011
 51
345.5624498171989
  0
ARC
  5
9B
  8
AUSSEN
 10
206.0453645119865
 20
145.6144059604129
 30
0.0
 40
5.013544225162513
 50
194.4375501828011
 51
345.5624498171989
  0
LINE
  5
9C
  8
INNEN
 10
23.05
 20
40.0
 30
0.0
 11
23.05
 21
41.8
 31
0.0
  0
LINE
  5
9D
  8
INNEN
 10
67.84999999999998
 20
138.2
 30
0.0
 11
67.84999999999998
 21
140.0
 31
0.0
  0
LINE
  5
9E
  8
INNEN
 10
116.05
 20
138.2
 30
0.0
 11
116.05
 21
140.0
 31
0.0
  0
LINE
  5
9F
  8
INNEN
 10
162.8367848723481
 20
138.5108983653537
 30
0.0
 11
162.8367848723481
 21
140.3108983653537
 31
0.0
  0
LINE
  5
A0
  8
AUSSEN
 10
207.686208059797
 20
85.32534858523093
 30
0.0
 11
207.686208059797
 21
87.12534858523094
 31
0.0
  0
LINE
  5
A1
  8
AUSSEN
 10
207.85
 20
40.0
 30
0.0
 11
207.85
 21
41.8
 31
0.0
  0
ARC
  5
A2
  8
AUSSEN
 10
153.8849542555763
 20
147.8407649347719
 30
0.0
 40
5.013544225162515
 50
14.43755018280111
 51
165.5624498171989
  0
ARC
  5
A3
  8
AUSSEN
 10
206.0453645119865
 20
145.6144059604129
 30
0.0
 40
5.013544225162515
 50
14.43755018280111
 51
165.5624498171989
  0
LINE
  5
A4
  8
INNEN
 10
23.04999999999997
 20
138.2
 30
0.0
 11
23.04999999999997
 21
140.0
 31
0.0
  0
LINE
  5
A5
  8
INNEN
 10
67.85000000000001
 20
70.0
 30
0.0
 11
67.85000000000001
 21
71.8
 31
0.0
  0
LINE
  5
A6
  8
INNEN
 10
116.05
 20
70.0
 30
0.0
 11
116.05
 21
71.8
 31
0.0
  0
LINE
  5
A7
  8
INNEN
 10
162.8367848723481
 20
70.3108983653537
 30
0.0
 11
162.8367848723481
 21
72.11089836535369
 31
0.0
  0
LINE
  5
A8
  8
AUSSEN
 10
186.436208059797
 20
66.57534858523093
 30
0.0
 11
184.636208059797
 21
66.57534858523093
 31
0.0
  0
LINE
  5
A9
  8
AUSSEN
 10
186.6
 20
21.25
 30
0.0
 11
184.8
 21
21.25
 31
0.0
  0
LINE
  5
AA
  8
INNEN
 10
153.8849542555763
 20
152.8543091599344
 30
0.0
 11
153.8849542555763
 21
151.2907649347719
 31
0.0
  0
LINE
  5
AB
  8
INNEN
 10
206.0453645119865
 20
150.6279501855754
 30
0.0
 11
206.0453645119865
 21
149.0644059604129
 31
0.0
  0
LINE
  5
AC
  8
INNEN
 10
23.05
 20
70.0
 30
0.0
 11
23.05
 21
71.8
 31
0.0
  0
LINE
  5
AD
  8
INNEN
 10
67.85
 20
4.999999999999999
 30
0.0
 11
67.85
 21
6.8
 31
0.0
  0
LINE
  5
AE
  8
INNEN
 10
116.05
 20
5.000000000000004
 30
0.0
 11
116.05
 21
6.800000000000005
 31
0.0
  0
LINE
  5
AF
  8
INNEN
 10
162.8367848723481
 20
5.310898365353693
 30
0.0
 11
162.8367848723481
 21
7.11089836535369
 31
0.0
  0
LINE
  5
B0
  8
AUSSEN
 10
228.236208059797
 20
66.57534858523093
 30
0.0
 11
226.436208059797
 21
66.57534858523093
 31
0.0
  0
LINE
  5
B1
  8
AUSSEN
 10
228.4
 20
21.25
 30
0.0
 11
226.6
 21
21.25
 31
0.0
  0
LINE
  5
B2
  8
INNEN
 10
23.04999999999999
 20
4.999999999999999
 30
0.0
 11
23.04999999999999
 21
6.799999999999996
 31
0.0
  0
LINE
  5
B3
  8
INNEN
 10
67.85
 20
31.8
 30
0.0
 11
65.35
 21
31.8
 31
0.0
  0
LINE
  5
B4
  8
INNEN
 10
116.05
 20
31.8
 30
0.0
 11
113.55
 21
31.8
 31
0.0
  0
LINE
  5
B5
  8
INNEN
 10
162.8367848723481
 20
32.11089836535369
 30
0.0
 11
160.3367848723481
 21
32.11089836535369
 31
0.0
  0
LINE
  5
B6
  8
AUSSEN
 10
207.686208059797
 20
87.12534858523094
 30
0.0
 11
205.186208059797
 21
87.12534858523094
 31
0.0
  0
LINE
  5
B7
  8
AUSSEN
 10
207.85
 20
41.8
 30
0.0
 11
205.35
 21
41.8
 31
0.0
  0
LINE
  5
B8
  8
INNEN
 10
23.05
 20
31.8
 30
0.0
 11
20.55
 21
31.8
 31
0.0
  0
LINE
  5
B9
  8
INNEN
 10
67.85
 20
41.8
 30
0.0
 11
65.35
 21
41.8
 31
0.0
  0
LINE
  5
BA
  8
INNEN
 10
116.05
 20
41.8
 30
0.0
 11
113.55
 21
41.8
 31
0.0
  0
LINE
  5
BB
  8
INNEN
 10
162.8367848723481
 20
42.11089836535369
 30
0.0
 11
160.3367848723481
 21
42.11089836535369
 31
0.0
  0
LINE
  5
BC
  8
AUSSEN
 10
184.636208059797
 20
66.57534858523093
 30
0.0
 11
184.636208059797
 21
64.07534858523093
 31
0.0
  0
LINE
  5
BD
  8
AUSSEN
 10
184.8
 20
21.25
 30
0.0
 11
184.8
 21
18.75
 31
0.0
  0
LINE
  5
BE
  8
INNEN
 10
23.05
 20
41.8
 30
0.0
 11
20.55
 21
41.8
 31
0.0
  0
LINE
  5
BF
  8
INNEN
 10
67.84999999999998
 20
140.0
 30
0.0
 11
65.34999999999998
 21
140.0
 31
0.0
  0
LINE
  5
C0
  8
INNEN
 10
116.05
 20
140.0
 30
0.0
 11
113.55
 21
140.0
 31
0.0
  0
LINE
  5
C1
  8
INNEN
 10
162.8367848723481
 20
140.3108983653537
 30
0.0
 11
160.3367848723481
 21
140.3108983653537
 31
0.0
  0
LINE
  5
C2
  8
AUSSEN
 10
205.186208059797
 20
45.32534858523093
 30
0.0
 11
205.186208059797
 21
43.52534858523093
 31
0.0
  0
LINE
  5
C3
  8
AUSSEN
 10
205.35
 20
-0.0000000000000013
 30
0.0
 11
205.35
 21
-1.800000000000002
 31
0.0
  0
LINE
  5
C4
  8
INNEN
 10
23.04999999999997
 20
140.0
 30
0.0
 11
20.54999999999997
 21
140.0
 31
0.0
  0
LINE
  5
C5
  8
INNEN
 10
67.85000000000001
 20
71.8
 30
0.0
 11
65.35000000000001
 21
71.8
 31
0.0
  0
LINE
  5
C6
  8
INNEN
 10
116.05
 20
71.8
 30
0.0
 11
113.55
 21
71.8
 31
0.0
  0
LINE
  5
C7
  8
INNEN
 10
162.8367848723481
 20
72.11089836535369
 30
0.0
 11
160.3367848723481
 21
72.11089836535369
 31
0.0
  0
LINE
  5
C8
  8
AUSSEN
 10
205.186208059797
 20
87.12534858523094
 30
0.0
 11
205.186208059797
 21
85.32534858523093
 31
0.0
  0
LINE
  5
C9
  8
AUSSEN
 10
205.35
 20
41.8
 30
0.0
 11
205.35
 21
40.0
 31
0.0
  0
LINE
  5
CA
  8
INNEN
 10
23.05
 20
71.8
 30
0.0
 11
20.55
 21
71.8
 31
0.0
  0
LINE
  5
CB
  8
INNEN
 10
67.85
 20
6.8
 30
0.0
 11
65.35
 21
6.8
 31
0.0
  0
LINE
  5
CC
  8
INNEN
 10
116.05
 20
6.800000000000005
 30
0.0
 11
113.55
 21
6.800000000000005
 31
0.0
  0
LINE
  5
CD
  8
INNEN
 10
162.8367848723481
 20
7.11089836535369
 30
0.0
 11
160.3367848723481
 21
7.11089836535369
 31
0.0
  0
LINE
  5
CE
  8
AUSSEN
 10
184.636208059797
 20
64.07534858523093
 30
0.0
 11
186.436208059797
 21
64.07534858523093
 31
0.0
  0
LINE
  5
CF
  8
AUSSEN
 10
184.8
 20
18.75
 30
0.0
 11
186.6
 21
18.75
 31
0.0
  0
LINE
  5
D0
  8
INNEN
 10
23.04999999999999
 20
6.799999999999996
 30
0.0
 11
20.54999999999999
 21
6.799999999999996
 31
0.0
  0
LINE
  5
D1
  8
INNEN
 10
65.35
 20
31.8
 30
0.0
 11
65.35
 21
30.0
 31
0.0
  0
LINE
  5
D2
  8
INNEN
 10
113.55
 20
31.8
 30
0.0
 11
113.55
 21
30.0
 31
0.0
  0
LINE
  5
D3
  8
INNEN
 10
160.3367848723481
 20
32.11089836535369
 30
0.0
 11
160.3367848723481
 21
30.31089836535369
 31
0.0
  0
LINE
  5
D4
  8
AUSSEN
 10
226.436208059797
 20
64.07534858523093
 30
0.0
 11
228.236208059797
 21
64.07534858523093
 31
0.0
  0
LINE
  5
D5
  8
AUSSEN
 10
226.6
 20
18.75
 30
0.0
 11
228.4
 21
18.75
 31
0.0
  0
LINE
  5
D6
  8
INNEN
 10
20.55
 20
31.8
 30
0.0
 11
20.55
 21
30.0
 31
0.0
  0
LINE
  5
D7
  8
INNEN
 10
65.35
 20
41.8
 30
0.0
 11
65.35
 21
40.0
 31
0.0
  0
LINE
  5
D8
  8
INNEN
 10
113.55
 20
41.8
 30
0.0
 11
113.55
 21
40.00000000000001
 31
0.0
  0
LINE
  5
D9
  8
INNEN
 10
160.3367848723481
 20
42.11089836535369
 30
0.0
 11
160.3367848723481
 21
40.31089836535369
 31
0.0
  0
LINE
  5
DA
  8
AUSSEN
 10
207.686208059797
 20
85.32534858523093
 30
0.0
 11
226.436208059797
 21
85.32534858523093
 31
0.0
  0
LINE
  5
DB
  8
AUSSEN
 10
207.85
 20
40.0
 30
0.0
 11
226.6
 21
40.0
 31
0.0
  0
LINE
  5
DC
  8
INNEN
 10
20.55
 20
41.8
 30
0.0
 11
20.55
 21
40.0
 31
0.0
  0
LINE
  5
DD
  8
INNEN
 10
65.34999999999998
 20
140.0
 30
0.0
 11
65.34999999999998
 21
138.2
 31
0.0
  0
LINE
  5
DE
  8
INNEN
 10
113.55
 20
140.0
 30
0.0
 11
113.55
 21
138.2
 31
0.0
  0
LINE
  5
DF
  8
INNEN
 10
160.3367848723481
 20
140.3108983653537
 30
0.0
 11
160.3367848723481
 21
138.5108983653537
 31
0.0
  0
LINE
  5
E0
  8
AUSSEN
 10
186.436208059797
 20
85.32534858523093
 30
0.0
 11
186.436208059797
 21
66.57534858523093
 31
0.0
  0
LINE
  5
E1
  8
AUSSEN
 10
186.6
 20
40.0
 30
0.0
 11
186.6
 21
21.25
 31
0.0
  0
LINE
  5
E2
  8
INNEN
 10
20.54999999999997
 20
140.0
 30
0.0
 11
20.54999999999997
 21
138.2
 31
0.0
  0
LINE
  5
E3
  8
INNEN
 10
65.35000000000001
 20
71.8
 30
0.0
 11
65.35000000000001
 21
70.0
 31
0.0
  0
LINE
  5
E4
  8
INNEN
 10
113.55
 20
71.8
 30
0.0
 11
113.55
 21
70.0
 31
0.0
  0
LINE
  5
E5
  8
INNEN
 10
160.3367848723481
 20
72.11089836535369
 30
0.0
 11
160.3367848723481
 21
70.3108983653537
 31
0.0
  0
LINE
  5
E6
  8
AUSSEN
 10
186.436208059797
 20
64.07534858523093
 30
0.0
 11
186.436208059797
 21
45.32534858523093
 31
0.0
  0
LINE
  5
E7
  8
AUSSEN
 10
186.6
 20
18.75
 30
0.0
 11
186.6
 21
-0.0000000000000013
 31
0.0
  0
LINE
  5
E8
  8
INNEN
 10
20.55
 20
71.8
 30
0.0
 11
20.55
 21
70.0
 31
0.0
  0
LINE
  5
E9
  8
INNEN
 10
65.35
 20
6.8
 30
0.0
 11
65.35
 21
4.999999999999999
 31
0.0
  0
LINE
  5
EA
  8
INNEN
 10
113.55
 20
6.800000000000005
 30
0.0
 11
113.55
 21
5.000000000000004
 31
0.0
  0
LINE
  5
EB
  8
INNEN
 10
160.3367848723481
 20
7.11089836535369
 30
0.0
 11
160.3367848723481
 21
5.310898365353693
 31
0.0
  0
LINE
  5
EC
  8
AUSSEN
 10
226.436208059797
 20
45.32534858523093
 30
0.0
 11
226.436208059797
 21
64.07534858523093
 31
0.0
  0
LINE
  5
ED
  8
AUSSEN
 10
226.6
 20
-0.0000000000000013
 30
0.0
 11
226.6
 21
18.75
 31
0.0
  0
LINE
  5
EE
  8
INNEN
 10
20.54999999999999
 20
6.799999999999996
 30
0.0
 11
20.54999999999999
 21
4.999999999999999
 31
0.0
  0
LINE
  5
EF
  8
AUSSEN
 10
226.436208059797
 20
66.57534858523093
 30
0.0
 11
226.436208059797
 21
85.32534858523093
 31
0.0
  0
LINE
  5
F0
  8
AUSSEN
 10
226.6
 20
21.25
 30
0.0
 11
226.6
 21
40.0
 31
0.0
  0
LINE
  5
F1
  8
INNEN
 10
4.79999999999999
 20
134.0
 30
0.0
 11
38.79999999999999
 21
134.0
 31
0.0
  0
LINE
  5
F2
  8
AUSSEN
 10
186.436208059797
 20
45.32534858523093
 30
0.0
 11
205.186208059797
 21
45.32534858523093
 31
0.0
  0
LINE
  5
F3
  8
AUSSEN
 10
186.6
 20
-0.0000000000000013
 30
0.0
 11
205.35
 21
-0.0000000000000013
 31
0.0
  0
LINE
  5
F4
  8
INNEN
 10
38.79999999999999
 20
134.0
 30
0.0
 11
38.79999999999999
 21
75.0
 31
0.0
  0
LINE
  5
F5
  8
AUSSEN
 10
207.686208059797
 20
45.32534858523093
 30
0.0
 11
226.436208059797
 21
45.32534858523093
 31
0.0
  0
LINE
  5
F6
  8
AUSSEN
 10
207.85
 20
-0.0000000000000013
 30
0.0
 11
226.6
 21
-0.0000000000000013
 31
0.0
  0
LINE
  5
F7
  8
INNEN
 10
38.79999999999999
 20
75.0
 30
0.0
 11
4.79999999999999
 21
75.0
 31
0.0
  0
LINE
  5
F8
  8
INNEN
 10
65.59999999999998
 20
74.0
 30
0.0
 11
67.6
 21
74.0
 31
0.0
  0
LINE
  5
F9
  8
INNEN
 10
113.8
 20
74.0
 30
0.0
 11
115.8
 21
74.0
 31
0.0
  0
LINE
  5
FA
  8
INNEN
 10
130.8395897435898
 20
157.226358974359
 30
0.0
 11
132.8395897435898
 21
157.226358974359
 31
0.0
  0
LINE
  5
FB
  8
INNEN
 10
225.3546354880135
 20
158.1355940395871
 30
0.0
 11
227.3546354880135
 21
158.1355940395871
 31
0.0
  0
LINE
  5
FC
  8
INNEN
 10
4.79999999999999
 20
75.0
 30
0.0
 11
4.79999999999999
 21
134.0
 31
0.0
  0
LINE
  5
FD
  8
INNEN
 10
67.6
 20
74.0
 30
0.0
 11
67.6
 21
78.99999999999999
 31
0.0
  0
LINE
  5
FE
  8
INNEN
 10
115.8
 20
74.0
 30
0.0
 11
115.8
 21
78.99999999999999
 31
0.0
  0
LINE
  5
FF
  8
INNEN
 10
132.8395897435898
 20
157.226358974359
 30
0.0
 11
132.8395897435898
 21
162.226358974359
 31
0.0
  0
LINE
  5
100
  8
INNEN
 10
227.3546354880135
 20
158.1355940395871
 30
0.0
 11
227.3546354880135
 21
163.1355940395871
 31
0.0
  0
LINE
  5
101
  8
INNEN
 10
67.6
 20
78.99999999999999
 30
0.0
 11
65.59999999999998
 21
78.99999999999999
 31
0.0
  0
LINE
  5
102
  8
INNEN
 10
115.8
 20
78.99999999999999
 30
0.0
 11
113.8
 21
78.99999999999999
 31
0.0
  0
LINE
  5
103
  8
INNEN
 10
132.8395897435898
 20
162.226358974359
 30
0.0
 11
130.8395897435898
 21
162.226358974359
 31
0.0
  0
LINE
  5
104
  8
INNEN
 10
227.3546354880135
 20
163.1355940395871
 30
0.0
 11
225.3546354880135
 21
163.1355940395871
 31
0.0
  0
LINE
  5
105
  8
INNEN
 10
65.59999999999998
 20
94.0
 30
0.0
 11
67.59999999999998
 21
94.0
 31
0.0
  0
LINE
  5
106
  8
INNEN
 10
113.8
 20
94.0
 30
0.0
 11
115.8
 21
94.0
 31
0.0
  0
LINE
  5
107
  8
INNEN
 10
130.8395897435898
 20
177.226358974359
 30
0.0
 11
132.8395897435898
 21
177.226358974359
 31
0.0
  0
LINE
  5
108
  8
AUSSEN
 10
205.186208059797
 20
135.3253485852309
 30
0.0
 11
186.436208059797
 21
135.3253485852309
 31
0.0
  0
LINE
  5
109
  8
INNEN
 10
225.3546354880135
 20
178.1355940395871
 30
0.0
 11
227.3546354880135
 21
178.1355940395871
 31
0.0
  0
LINE
  5
10A
  8
INNEN
 10
67.59999999999998
 20
94.0
 30
0.0
 11
67.59999999999998
 21
89.0
 31
0.0
  0
LINE
  5
10B
  8
INNEN
 10
115.8
 20
94.0
 30
0.0
 11
115.8
 21
89.0
 31
0.0
  0
LINE
  5
10C
  8
INNEN
 10
132.8395897435898
 20
177.226358974359
 30
0.0
 11
132.8395897435898
 21
172.226358974359
 31
0.0
  0
LINE
  5
10D
  8
INNEN
 10
227.3546354880135
 20
178.1355940395871
 30
0.0
 11
227.3546354880135
 21
173.1355940395871
 31
0.0
  0
LINE
  5
10E
  8
INNEN
 10
67.59999999999998
 20
89.0
 30
0.0
 11
65.59999999999998
 21
89.0
 31
0.0
  0
LINE
  5
10F
  8
INNEN
 10
115.8
 20
89.0
 30
0.0
 11
113.8
 21
89.0
 31
0.0
  0
LINE
  5
110
  8
INNEN
 10
132.8395897435898
 20
172.226358974359
 30
0.0
 11
130.8395897435898
 21
172.226358974359
 31
0.0
  0
LINE
  5
111
  8
INNEN
 10
227.3546354880135
 20
173.1355940395871
 30
0.0
 11
225.3546354880135
 21
173.1355940395871
 31
0.0
  0
LINE
  5
112
  8
INNEN
 10
65.59999999999998
 20
89.0
 30
0.0
 11
65.59999999999998
 21
89.0
 31
0.0
  0
LINE
  5
113
  8
INNEN
 10
113.8
 20
89.0
 30
0.0
 11
113.8
 21
89.0
 31
0.0
  0
LINE
  5
114
  8
INNEN
 10
130.8395897435898
 20
172.226358974359
 30
0.0
 11
130.8395897435898
 21
172.226358974359
 31
0.0
  0
LINE
  5
115
  8
INNEN
 10
225.3546354880135
 20
173.1355940395871
 30
0.0
 11
225.3546354880135
 21
173.1355940395871
 31
0.0
  0
LINE
  5
116
  8
INNEN
 10
130.8395897435898
 20
172.226358974359
 30
0.0
 11
130.8395897435898
 21
162.226358974359
 31
0.0
  0
LINE
  5
117
  8
INNEN
 10
225.3546354880135
 20
173.1355940395871
 30
0.0
 11
225.3546354880135
 21
163.1355940395871
 31
0.0
  0
LINE
  5
118
  8
INNEN
 10
65.59999999999998
 20
78.99999999999999
 30
0.0
 11
65.59999999999998
 21
78.99999999999999
 31
0.0
  0
LINE
  5
119
  8
INNEN
 10
113.8
 20
78.99999999999999
 30
0.0
 11
113.8
 21
78.99999999999999
 31
0.0
  0
LINE
  5
11A
  8
INNEN
 10
130.8395897435898
 20
162.226358974359
 30
0.0
 11
130.8395897435898
 21
162.226358974359
 31
0.0
  0
LINE
  5
11B
  8
AUSSEN
 10
205.186208059797
 20
93.52534858523092
 30
0.0
 11
207.686208059797
 21
93.52534858523092
 31
0.0
  0
LINE
  5
11C
  8
AUSSEN
 10
228.236208059797
 20
114.0753485852309
 30
0.0
 11
228.236208059797
 21
116.5753485852309
 31
0.0
  0
LINE
  5
11D
  8
INNEN
 10
225.3546354880135
 20
163.1355940395871
 30
0.0
 11
225.3546354880135
 21
163.1355940395871
 31
0.0
  0
LINE
  5
11E
  8
INNEN
 10
130.8395897435898
 20
162.226358974359
 30
0.0
 11
130.8395897435898
 21
172.226358974359
 31
0.0
  0
LINE
  5
11F
  8
AUSSEN
 10
207.686208059797
 20
93.52534858523092
 30
0.0
 11
207.686208059797
 21
95.32534858523093
 31
0.0
  0
LINE
  5
120
  8
AUSSEN
 10
207.686208059797
 20
135.3253485852309
 30
0.0
 11
207.686208059797
 21
137.1253485852309
 31
0.0
  0
LINE
  5
121
  8
AUSSEN
 10
186.436208059797
 20
116.5753485852309
 30
0.0
 11
184.636208059797
 21
116.5753485852309
 31
0.0
  0
LINE
  5
122
  8
AUSSEN
 10
228.236208059797
 20
116.5753485852309
 30
0.0
 11
226.436208059797
 21
116.5753485852309
 31
0.0
  0
LINE
  5
123
  8
INNEN
 10
225.3546354880135
 20
163.1355940395871
 30
0.0
 11
225.3546354880135
 21
173.1355940395871
 31
0.0
  0
LINE
  5
124
  8
INNEN
 10
130.8395897435898
 20
152.226358974359
 30
0.0
 11
130.8395897435898
 21
157.226358974359
 31
0.0
  0
LINE
  5
125
  8
AUSSEN
 10
207.686208059797
 20
137.1253485852309
 30
0.0
 11
205.186208059797
 21
137.1253485852309
 31
0.0
  0
LINE
  5
126
  8
AUSSEN
 10
184.636208059797
 20
116.5753485852309
 30
0.0
 11
184.636208059797
 21
114.0753485852309
 31
0.0
  0
LINE
  5
127
  8
INNEN
 10
225.3546354880135
 20
153.1355940395871
 30
0.0
 11
225.3546354880135
 21
158.1355940395871
 31
0.0
  0
LINE
  5
128
  8
INNEN
 10
65.59999999999998
 20
94.0
 30
0.0
 11
65.59999999999998
 21
89.0
 31
0.0
  0
LINE
  5
129
  8
INNEN
 10
113.8
 20
94.0
 30
0.0
 11
113.8
 21
89.0
 31
0.0
  0
LINE
  5
12A
  8
INNEN
 10
130.8395897435898
 20
177.226358974359
 30
0.0
 11
130.8395897435898
 21
182.226358974359
 31
0.0
  0
LINE
  5
12B
  8
AUSSEN
 10
205.186208059797
 20
95.32534858523093
 30
0.0
 11
205.186208059797
 21
93.52534858523092
 31
0.0
  0
LINE
  5
12C
  8
AUSSEN
 10
205.186208059797
 20
137.1253485852309
 30
0.0
 11
205.186208059797
 21
135.3253485852309
 31
0.0
  0
LINE
  5
12D
  8
AUSSEN
 10
184.636208059797
 20
114.0753485852309
 30
0.0
 11
186.436208059797
 21
114.0753485852309
 31
0.0
  0
LINE
  5
12E
  8
AUSSEN
 10
226.436208059797
 20
114.0753485852309
 30
0.0
 11
228.236208059797
 21
114.0753485852309
 31
0.0
  0
LINE
  5
12F
  8
INNEN
 10
225.3546354880135
 20
178.1355940395871
 30
0.0
 11
225.3546354880135
 21
183.1355940395871
 31
0.0
  0
LINE
  5
130
  8
INNEN
 10
65.59999999999998
 20
78.99999999999999
 30
0.0
 11
65.59999999999998
 21
74.0
 31
0.0
  0
LINE
  5
131
  8
INNEN
 10
113.8
 20
78.99999999999999
 30
0.0
 11
113.8
 21
74.0
 31
0.0
  0
LINE
  5
132
  8
AUSSEN
 10
207.686208059797
 20
135.3253485852309
 30
0.0
 11
226.436208059797
 21
135.3253485852309
 31
0.0
  0
LINE
  5
133
  8
AUSSEN
 10
186.436208059797
 20
135.3253485852309
 30
0.0
 11
186.436208059797
 21
116.5753485852309
 31
0.0
  0
LINE
  5
134
  8
AUSSEN
 10
186.436208059797
 20
114.0753485852309
 30
0.0
 11
186.436208059797
 21
95.32534858523093
 31
0.0
  0
LINE
  5
135
  8
AUSSEN
 10
226.436208059797
 20
95.32534858523093
 30
0.0
 11
226.436208059797
 21
114.0753485852309
 31
0.0
  0
LINE
  5
136
  8
AUSSEN
 10
226.436208059797
 20
116.5753485852309
 30
0.0
 11
226.436208059797
 21
135.3253485852309
 31
0.0
  0
LINE
  5
137
  8
AUSSEN
 10
186.436208059797
 20
95.32534858523093
 30
0.0
 11
205.186208059797
 21
95.32534858523093
 31
0.0
  0
LINE
  5
138
  8
AUSSEN
 10
207.686208059797
 20
95.32534858523093
 30
0.0
 11
226.436208059797
 21
95.32534858523093
 31
0.0
  0
LINE
  5
139
  8
INNEN
 10
196.436208059797
 20
105.3253485852309
 30
0.0
 11
216.436208059797
 21
105.3253485852309
 31
0.0
  0
LINE
  5
13A
  8
INNEN
 10
216.436208059797
 20
105.3253485852309
 30
0.0
 11
216.436208059797
 21
125.3253485852309
 31
0.0
  0
LINE
  5
13B
  8
INNEN
 10
216.436208059797
 20
125.3253485852309
 30
0.0
 11
196.436208059797
 21
125.3253485852309
 31
0.0
  0
LINE
  5
13C
  8
INNEN
 10
196.436208059797
 20
125.3253485852309
 30
0.0
 11
196.436208059797
 21
105.3253485852309
 31
0.0
  0
LINE
  5
13D
  8
0
 10
0.0
 20
-0.0000000000000013
 30
0.0
 11
320.0
 21
-0.0000000000000013
 31
0.0
  0
LINE
  5
13E
  8
0
 10
320.0
 20
-0.0000000000000013
 30
0.0
 11
320.0
 21
120.0
 31
0.0
  0
LINE
  5
13F
  8
0
 10
320.0
 20
120.0
 30
0.0
 11
0.0
 21
120.0
 31
0.0
  0
LINE
  5
140
  8
0
 10
0.0
 20
120.0
 30
0.0
 11
0.0
 21
-0.0000000000000013
 31
0.0
  0
ENDSEC
  0
EOF
